program: Orca
programVersion: 4.2.1
elementType: S O O O O O O O N N N N N N C C C C C C C C C C C C C C H H H H H H H H H H H H H H H H H H
charge: 0
multiplicity: 1
keywords: wb97x-d3
keywords: def2-TZVPP
keywords: def2/J RIJCOSX GRIDX6 NOFINALGRIDX
keywords: grid4 nofinalgrid
keywords: scfconv7
keywords: smallprint printgap noloewdin
keywords: NOSOSCF
formula: C14H18N6O7S
InChI: InChI=1S/C14H18N6O7S/c1-5-27-12(21)8-7-15-20(2)11(8)28(23,24)19-14(22)18-13-16-9(25-3)6-10(17-13)26-4/h6-7,18-19H,5H2,1-4H3
46 atoms
S  1.823026 -0.925643 1.55527
O  1.827152 0.277811 2.353222
O  2.337011 -2.15403 2.11196
O  1.844542 2.529598 -1.61639
O  0.619407 1.610486 0.015981
O  0.67422 -2.885621 -0.291788
O  -2.91871 1.789328 1.865368
O  -5.394781 -0.157884 -1.542197
N  3.635875 -1.384808 -0.477637
N  0.248866 -1.133944 1.088325
N  4.137454 -0.861374 -1.586323
N  -1.376775 -1.944115 -0.356562
N  -2.131905 -0.067548 0.789773
N  -3.390587 -1.065044 -0.93682
C  2.666603 -0.606519 0.036735
C  2.534485 0.491789 -0.802972
C  3.4920 0.265428 -1.798222
C  4.168307 -2.656508 -0.019883
C  1.56436 1.587158 -0.731876
C  -0.095804 -2.047323 0.125069
C  0.95683 3.657058 -1.713486
C  -2.336643 -0.974645 -0.148463
C  1.206629 4.683046 -0.633415
C  -3.071038 0.861092 0.940936
C  -4.319042 -0.132883 -0.777345
C  -4.216509 0.885923 0.162675
C  -1.758804 1.764003 2.695222
C  -5.522875 -1.188854 -2.517181
H  3.720203 0.872657 -2.659556
H  -0.425588 -0.380271 1.290607
H  4.68679 -2.545549 0.928188
H  4.8755 -2.984106 -0.774317
H  3.37685 -3.393314 0.073221
H  -0.080368 3.317292 -1.707956
H  1.164498 4.078555 -2.695602
H  2.247853 5.006481 -0.625047
H  0.589258 5.559791 -0.833633
H  0.947394 4.315209 0.358166
H  -4.978373 1.642121 0.281273
H  -0.850381 1.94199 2.120934
H  -1.890615 2.574559 3.406996
H  -1.674073 0.824991 3.242815
H  -4.708741 -1.165441 -3.24156
H  -5.565516 -2.176367 -2.0574
H  -6.4614 -0.992631 -3.02886
H  -1.606154 -2.620578 -1.073587
elementType: S O N C H
totalener: -1797.80203541 hartree
nucrepener: 3106.00263667 hartree
electener: -4903.80467208 hartree
oneelecener: -8641.22690701 hartree
twoeener: 3737.42223493 hartree
cpcmener: -0.03415882 hartree
kineticenergy: 1791.38228222 hartree
xcener: -147.482934719379 hartree
chargesum: 0.0000000
charge: 0.880143 -0.482690 -0.482939 -0.286803 -0.446699 -0.457451 -0.289130 -0.292444 0.189358 -0.202941 -0.317141 -0.139556 -0.413794 -0.424267 -0.116677 -0.079792 -0.060997 -0.153841 0.508189 0.364172 0.044775 0.362528 -0.259283 0.420499 0.414789 -0.328081 -0.125841 -0.114530 0.162673 0.224311 0.130909 0.114898 0.127752 0.089460 0.110634 0.088718 0.096629 0.091267 0.143893 0.107258 0.139106 0.116116 0.112488 0.113479 0.130535 0.190319
qa: 0.8801 -0.4827 -0.4829 -0.2868 -0.4467 -0.4575 -0.2891 -0.2924 0.1894 -0.2029 -0.3171 -0.1396 -0.4138 -0.4243 -0.1167 -0.0798 -0.0610 -0.1538 0.5082 0.3642 0.0448 0.3625 -0.2593 0.4205 0.4148 -0.3281 -0.1258 -0.1145 0.1627 0.2243 0.1309 0.1149 0.1278 0.0895 0.1106 0.0887 0.0966 0.0913 0.1439 0.1073 0.1391 0.1161 0.1125 0.1135 0.1305 0.1903
va: 5.8912 2.0156 2.0186 2.1450 2.0395 2.0555 2.1387 2.1296 3.3650 3.0848 2.9004 3.1821 2.9667 2.9680 4.0663 3.6911 4.1066 3.8502 4.1092 4.4056 3.8401 4.2547 3.9161 3.9893 4.0241 3.9365 3.8443 3.8499 1.0086 1.0542 0.9926 1.0100 1.0010 1.0108 0.9958 1.0053 1.0061 1.0108 1.0169 0.9967 0.9955 0.9924 0.9960 0.9954 0.9941 1.0184
dispcorr: -0.026057974 hartree
energy: -1797.828093386666
dipole: -6.05802 4.17671 -1.88131 13.46825 -12.20915 1.25910 -6.82675 5.03539 -1.79136
magnitude: 2.88681 au
magnitude: 7.33768 debye
