program: Orca
programVersion: 4.2.1
elementType: S O O O O O O O N N N N N N C C C C C C C C C C C C C C H H H H H H H H H H H H H H H H H H
charge: 0
multiplicity: 1
keywords: wb97x-d3
keywords: def2-TZVPP
keywords: def2/J RIJCOSX GRIDX6 NOFINALGRIDX
keywords: grid4 nofinalgrid
keywords: scfconv7
keywords: smallprint printgap noloewdin
keywords: NOSOSCF
formula: C14H18N6O7S
InChI: InChI=1S/C14H18N6O7S/c1-5-27-12(21)8-7-15-20(2)11(8)28(23,24)19-14(22)18-13-16-9(25-3)6-10(17-13)26-4/h6-7,18-19H,5H2,1-4H3
46 atoms
S  1.856048 -0.883473 -1.478648
O  2.342346 -2.117986 -2.045661
O  1.900992 0.331695 -2.256847
O  1.870421 2.474018 1.797072
O  0.66971 1.626826 0.107217
O  0.636497 -2.840298 0.320211
O  -2.91867 1.816043 -1.96609
O  -5.591938 -0.301588 1.179543
N  3.661383 -1.403595 0.547771
N  0.270914 -1.057446 -1.03519
N  4.151215 -0.919512 1.679608
N  -1.414518 -1.896057 0.321977
N  -2.140714 -0.02119 -0.849912
N  -3.501332 -1.10529 0.742654
C  2.692504 -0.611403 0.054496
C  2.553466 0.457696 0.929591
C  3.500642 0.196841 1.926385
C  4.209477 -2.649937 0.044102
C  1.597293 1.56548 0.875677
C  -0.115469 -1.99174 -0.10943
C  1.00467 3.61677 1.90374
C  -2.388916 -0.957754 0.048378
C  1.329596 4.676809 0.877324
C  -3.108977 0.861515 -1.075973
C  -4.456777 -0.216717 0.510484
C  -4.32292 0.815478 -0.410303
C  -1.676371 1.8828 -2.663204
C  -5.743604 -1.334592 2.14872
H  3.720997 0.774094 2.810192
H  -0.384983 -0.292648 -1.248195
H  4.933876 -2.987308 0.777591
H  4.712305 -2.500675 -0.90721
H  3.431323 -3.399213 -0.06097
H  1.176667 3.992412 2.910952
H  -0.038512 3.304145 1.837164
H  2.367927 5.000229 0.954108
H  1.144101 4.338466 -0.141449
H  0.69694 5.546915 1.056927
H  -5.109005 1.533397 -0.59365
H  -1.768621 2.725313 -3.343684
H  -0.844294 2.066681 -1.984216
H  -1.490012 0.979333 -3.244878
H  -5.004262 -1.252367 2.945681
H  -6.737088 -1.198922 2.568233
H  -5.677069 -2.325186 1.698675
H  -1.676473 -2.5881 1.011976
elementType: S O N C H
totalener: -1797.80285210 hartree
nucrepener: 3094.21650498 hartree
electener: -4892.01935708 hartree
oneelecener: -8617.69302511 hartree
twoeener: 3725.67366803 hartree
cpcmener: -0.03465017 hartree
kineticenergy: 1791.37534768 hartree
xcener: -147.481857547611 hartree
chargesum: 0.0000000
charge: 0.877094 -0.481942 -0.481988 -0.286100 -0.452804 -0.457520 -0.289576 -0.292639 0.187558 -0.199874 -0.316433 -0.137722 -0.417715 -0.425911 -0.112833 -0.083157 -0.060960 -0.152760 0.514040 0.362962 0.044056 0.365957 -0.257784 0.418226 0.414462 -0.327694 -0.128047 -0.115029 0.162713 0.226424 0.114749 0.131077 0.126704 0.110952 0.089322 0.089377 0.090390 0.095892 0.144498 0.138945 0.110174 0.116246 0.113028 0.131227 0.112681 0.189733
qa: 0.8771 -0.4819 -0.4820 -0.2861 -0.4528 -0.4575 -0.2896 -0.2926 0.1876 -0.1999 -0.3164 -0.1377 -0.4177 -0.4259 -0.1128 -0.0832 -0.0610 -0.1528 0.5140 0.3630 0.0441 0.3660 -0.2578 0.4182 0.4145 -0.3277 -0.1280 -0.1150 0.1627 0.2264 0.1147 0.1311 0.1267 0.1110 0.0893 0.0894 0.0904 0.0959 0.1445 0.1389 0.1102 0.1162 0.1130 0.1312 0.1127 0.1897
va: 5.8921 2.0197 2.0149 2.1466 2.0318 2.0563 2.1391 2.1297 3.3673 3.0893 2.9011 3.1822 2.9668 2.9680 4.0683 3.6868 4.1079 3.8521 4.1039 4.4092 3.8381 4.2510 3.9192 3.9937 4.0259 3.9346 3.8436 3.8501 1.0086 1.0485 1.0104 0.9927 1.0000 0.9959 1.0116 1.0049 1.0113 1.0063 1.0168 0.9948 0.9974 0.9926 0.9959 0.9936 0.9956 1.0189
dispcorr: -0.025741137 hartree
energy: -1797.828593241400
dipole: -5.82357 3.96802 -1.85555 13.38873 -12.14603 1.24269 6.85146 -5.13219 1.71927
magnitude: 2.81838 au
magnitude: 7.16374 debye
