program: Gaussian 09
title: 000074147
version: EM64L-G09RevD.01
frameworkgroup: C1[X(C14H6N2O6)]
method: RPBEPBE
basis: SDD
operation: Freq
keyword: #p
keyword: freq=noraman
keyword: PBEPBE/SDD
title: #p freq=noraman PBEPBE/SDD
converged: NO NO NO NO
title: Mulliken charges:
elementType: O O O O O O N N C C C C C C C C C C C C C C H H H H H H
charge: -0.158132 -0.171084 -0.154426 -0.154464 -0.190092 -0.179168 0.001927 0.024667 0.100880 0.315216 0.299987 0.281021 -0.155308 -0.214670 0.305794 -0.499836 -0.344796 -0.389196 0.407866 -0.313561 -0.378513 -0.210756 0.342615 0.300951 0.301306 0.272208 0.301535 0.258027
chargesum: 0.00000
title: Mulliken charges with hydrogens summed into heavy atoms:
elementType: O O O O O O N N C C C C C C C C C C C C C C
charge: -0.158132 -0.171084 -0.154426 -0.154464 -0.190092 -0.179168 0.001927 0.024667 0.100880 0.315216 0.299987 0.281021 -0.155308 -0.214670 0.305794 -0.157221 -0.043845 -0.087890 0.407866 -0.041352 -0.076978 0.047271
polarizability: 3.02175207e+02 -1.60942893e+00 2.24559854e+02 -8.21166073e-03 5.41977408e-03 8.39194109e+01
1716.lowfreq: -0.0007 0.0005 0.0007 2.6828 5.4995 6.0884 21.2333 41.5100 53.0767
frequency: 20.9926 41.4859 53.0274 86.7242 89.2555 102.0803 147.6450 160.0044 167.9707 181.6824 251.4088 262.0673 282.7101 303.4913 315.5424 353.3030 369.4448 418.6571 421.2591 435.0608 458.1043 496.2095 500.9850 516.3662 577.7358 621.8673 642.4034 647.0166 659.4650 683.0254 703.6590 704.3276 715.0292 747.8748 768.4452 811.8916 815.8898 832.1638 862.5536 905.5146 939.6696 952.6190 969.6948 986.4824 1012.2101 1019.7386 1064.2975 1075.3463 1110.7686 1139.3984 1162.9838 1181.9157 1198.3436 1210.7892 1242.3790 1249.9609 1275.4225 1303.2048 1372.5847 1388.1649 1389.0616 1409.0829 1423.7513 1439.5158 1445.4192 1464.1359 1543.2528 1553.9360 1572.4845 1596.2720 1600.9946 1618.0113 3154.7447 3165.1818 3166.6137 3177.6089 3180.3684 3187.6549
redmass: 13.7998 7.7090 14.8403 8.2175 11.8682 13.4715 6.4143 6.6357 12.0546 6.2636 8.5582 6.4913 11.4454 10.0414 7.7695 6.2420 11.3629 8.4657 4.7824 3.7608 11.7227 8.8639 4.7296 8.3964 5.3533 8.5047 7.2508 5.4859 9.6401 7.9189 10.0288 4.8940 3.3656 9.8235 7.3283 8.6869 1.5520 8.4488 2.0961 2.1459 6.7195 1.4716 6.0877 1.5064 1.3693 1.3774 2.0469 2.1455 2.2518 3.3015 1.7291 2.2878 1.6079 6.9115 1.8996 3.9536 2.6582 4.2402 10.7955 14.6452 10.3337 6.7886 5.5398 3.5691 2.7652 2.8768 10.8122 9.1812 7.5888 7.0173 9.1573 8.1532 1.0878 1.0905 1.0927 1.0925 1.1000 1.0961
irintensity: 0.1114 1.5162 0.0067 9.0916 0.9154 0.4946 0.8584 0.1147 3.7420 0.1754 0.4896 0.2679 0.5332 2.4545 2.6287 0.2213 30.3944 4.7101 0.0859 0.5844 3.2904 3.5652 0.1142 8.1853 5.8904 4.4250 4.3829 11.5419 21.4122 10.3560 17.3499 10.4916 33.0064 14.3115 6.4303 18.6317 37.2463 3.3860 1.9841 30.0619 2.6079 3.9915 53.2270 15.2164 1.6310 0.2837 28.5922 4.3984 10.6817 25.9794 12.6407 22.4172 45.0206 318.5132 28.1828 94.1283 54.5717 414.1583 116.2460 165.3333 1.0174 5.5083 4.5693 14.4341 16.1258 7.0915 7.1617 222.6400 0.5210 11.0833 1.4841 6.6354 1.9554 3.2911 0.4885 12.4873 6.6804 2.0100
temp: 298.150 k
press: 1.00000 atm
elementType: 8 8 8 8 8 8 7 7 6 6 6 6 6 6 6 6 6 6 6 6 6 6 1 1 1 1 1 1
symmnumber: 1
zpe: 467012.6 jmol-1
zpe.correction: 0.177876 hartree
zpe.thermalcorrener: 0.194928 hartree
zpe.thermalcorrenthalpy: 0.195872 hartree
zpe.thermalcorrgfe: 0.131307 hartree
zpe.sumelectzpe: -1096.271153 hartree
zpe.sumelectthermal: -1096.254100 hartree
zpe.sumelectthermalent: -1096.253156 hartree
zpe.sumelectthermalfe: -1096.317722 hartree
dipole: -3.4885 6.3497 -0.0011
dipole: 7.2449
quadrupole: -124.7041 -142.6026 -126.3854
quadrupole: -4.7719 -0.0073 -0.0012
quadrupole: 6.5266 -11.3719 4.8453 -4.7719 -0.0073 -0.0012
hfenergy: -1096.4490288 hartree
pointgroup: C01 [X(C14H6N2O6)]
dipole: -1.405069 -2.4799756 0.0004491 debye
polarizability: 302.2040399|0.5929377|224.5310217|0.0082819|0.0053118|83.9194109 unknown
InChI: InChI=1S/C14H6N2O6/c17-13-8-5-4-7(15(19)20)6-10(8)14(18)12-9(13)2-1-3-11(12)16(21)22/h1-6H
charge 0 multiplicity 1
28 atoms
O  -0.431994 2.085291 0.000713
O  -0.216415 -3.421813 -0.000376
O  -3.232038 2.651861 1.144611
O  -3.231522 2.651565 -1.145939
O  5.718197 0.315785 -0.000312
O  4.504806 2.250784 -0.000161
N  -3.104812 2.082414 -0.000552
N  4.603374 0.9660 0.00043
C  -1.637832 -0.003592 -0.000152
C  0.919937 0.092172 0.000122
C  -1.579951 -1.430626 -0.000194
C  0.982046 -1.331146 0.000045
C  -0.388509 0.818664 0.000041
C  -0.267296 -2.153626 0.000017
C  -2.920848 0.600589 -0.000313
C  2.112553 0.851051 0.000268
C  2.238762 -1.985858 0.000099
C  -2.766519 -2.201615 -0.000326
C  3.341865 0.171114 0.000296
C  -4.106438 -0.15874 -0.000346
C  3.430013 -1.240601 0.000215
C  -4.024813 -1.568817 -0.000381
H  2.069333 1.9439 0.000329
H  2.253467 -3.079751 0.000057
H  -2.671753 -3.291493 -0.000324
H  -5.076212 0.348276 -0.000466
H  4.414068 -1.716007 0.000269
H  -4.943571 -2.162779 -0.000472
