program: Orca
programVersion: 4.2.1
elementType: S O O O O O O O N N N N N N C C C C C C C C C C C C C C H H H H H H H H H H H H H H H H H H
charge: 0
multiplicity: 1
keywords: wb97x-d3
keywords: def2-TZVPP
keywords: def2/J RIJCOSX GRIDX6 NOFINALGRIDX
keywords: grid4 nofinalgrid
keywords: scfconv7
keywords: smallprint printgap noloewdin
keywords: NOSOSCF
formula: C14H18N6O7S
InChI: InChI=1S/C14H18N6O7S/c1-5-27-12(21)8-7-15-20(2)11(8)28(23,24)19-14(22)18-13-16-9(25-3)6-10(17-13)26-4/h6-7,18-19H,5H2,1-4H3
46 atoms
S  1.764571 -0.888147 1.541782
O  1.763066 0.322075 2.329768
O  2.219171 -2.126494 2.128411
O  2.045566 2.54851 -1.62835
O  0.694281 1.653418 -0.082856
O  0.64527 -2.837141 -0.33647
O  -3.012585 1.803474 1.79979
O  -5.566901 -0.344137 -1.425022
N  3.674634 -1.403056 -0.383587
N  0.211618 -1.059667 1.006617
N  4.242185 -0.903017 -1.470942
N  -1.409821 -1.905422 -0.42094
N  -2.188441 -0.032348 0.716505
N  -3.487189 -1.131707 -0.916025
C  2.691958 -0.60295 0.068199
C  2.627291 0.48848 -0.787704
C  3.630742 0.233069 -1.728804
C  4.168017 -2.673644 0.12009
C  1.684041 1.609612 -0.770818
C  -0.129194 -1.994598 0.063307
C  1.204522 3.708491 -1.76299
C  -2.399961 -0.974443 -0.185505
C  1.443898 4.718959 -0.666518
C  -3.168419 0.846002 0.906257
C  -4.454844 -0.247559 -0.720648
C  -4.357922 0.790441 0.198832
C  -1.797902 1.870928 2.543964
C  -5.685479 -1.391009 -2.384591
H  3.916823 0.826033 -2.58284
H  -0.460917 -0.302281 1.195281
H  3.367003 -3.403593 0.174442
H  4.629374 -2.554349 1.096148
H  4.916463 -3.014444 -0.586799
H  0.156808 3.407277 -1.806601
H  1.473254 4.124138 -2.732569
H  1.151166 4.345576 0.314116
H  2.490209 5.023096 -0.62634
H  0.848172 5.609162 -0.873134
H  -5.154444 1.503786 0.352127
H  -1.919486 2.707947 3.226652
H  -1.629413 0.96434 3.126407
H  -0.941663 2.062889 1.897978
H  -6.66489 -1.262749 -2.837825
H  -4.920762 -1.318546 -3.157984
H  -5.632379 -2.374842 -1.918482
H  -1.637906 -2.601714 -1.118712
elementType: S O N C H
totalener: -1797.80305488 hartree
nucrepener: 3090.80636149 hartree
electener: -4888.60941637 hartree
oneelecener: -8610.89980830 hartree
twoeener: 3722.29039193 hartree
cpcmener: -0.03455143 hartree
kineticenergy: 1791.38171275 hartree
xcener: -147.483425918374 hartree
chargesum: 0.0000000
charge: 0.876339 -0.483316 -0.484092 -0.285882 -0.452053 -0.458294 -0.289568 -0.292302 0.188644 -0.197747 -0.316836 -0.137351 -0.419236 -0.425616 -0.112733 -0.081970 -0.061656 -0.153172 0.511558 0.366054 0.044429 0.366269 -0.257749 0.418915 0.414275 -0.327116 -0.126248 -0.115106 0.163141 0.224574 0.126848 0.131203 0.114851 0.089689 0.110847 0.090111 0.089518 0.096122 0.144343 0.138944 0.114393 0.110042 0.130688 0.113329 0.113056 0.189861
qa: 0.8763 -0.4833 -0.4841 -0.2859 -0.4521 -0.4583 -0.2896 -0.2923 0.1886 -0.1977 -0.3168 -0.1374 -0.4192 -0.4256 -0.1127 -0.0820 -0.0617 -0.1532 0.5116 0.3661 0.0444 0.3663 -0.2577 0.4189 0.4143 -0.3271 -0.1262 -0.1151 0.1631 0.2246 0.1268 0.1312 0.1149 0.0897 0.1108 0.0901 0.0895 0.0961 0.1443 0.1389 0.1144 0.1100 0.1307 0.1133 0.1131 0.1899
va: 5.8954 2.0143 2.0176 2.1467 2.0332 2.0561 2.1397 2.1302 3.3662 3.0895 2.9003 3.1831 2.9676 2.9687 4.0654 3.6912 4.1074 3.8515 4.1066 4.4060 3.8372 4.2510 3.9186 3.9934 4.0253 3.9332 3.8444 3.8500 1.0084 1.0508 1.0005 0.9927 1.0102 1.0117 0.9959 1.0111 1.0049 1.0063 1.0169 0.9951 0.9933 0.9968 0.9940 0.9957 0.9956 1.0188
dispcorr: -0.025695244 hartree
energy: -1797.828750123927
dipole: -5.34154 3.56687 -1.77467 13.38123 -12.14300 1.23823 -6.65775 4.89051 -1.76724
magnitude: 2.79388 au
magnitude: 7.10149 debye
