program: Gaussian 09
title: 000069132
version: EM64L-G09RevD.01
frameworkgroup: C1[X(C8H7IO2)]
method: RPBEPBE
basis: SDD
operation: Freq
keyword: #pfreq=noraman
keyword: PBEPBE/SDD
title: #p freq=noraman PBEPBE/SDD
converged: YES YES NO NO
title: Mulliken charges:
elementType: I O O C C C C C C C C H H H H H H H
charge: 0.139785 -0.295698 -0.226651 0.309095 -0.451896 -0.308332 -0.153142 -0.222878 -0.215116 0.182058 -0.497122 0.285199 0.256274 0.237711 0.239984 0.243782 0.245186 0.231761
chargesum: 0.00000
title: Mulliken charges with hydrogens summed into heavy atoms:
elementType: I O O C C C C C C C C
charge: 0.139785 -0.295698 -0.226651 0.309095 -0.451896 -0.023133 0.103132 0.014832 0.024868 0.182058 0.223607
polarizability: 1.47817678e+02 -1.03370959e+01 1.49580409e+02 -8.98840512e-02 -5.38027790e-01 4.50924772e+01
1716.lowfreq: -11.0801 -6.8574 -2.7466 0.0003 0.0004 0.0006 17.1962 88.6055 107.7795
frequency: 17.1818 88.5993 107.7774 115.9437 140.7109 203.7351 223.8659 234.2986 319.0599 374.7465 430.0686 468.2489 487.1095 629.3511 669.1998 672.1221 739.5920 769.7850 782.8216 885.1418 922.8019 973.0688 995.1902 1001.5145 1039.0237 1067.2642 1114.5981 1128.4854 1146.5607 1177.0888 1229.0529 1265.2115 1366.3223 1410.9211 1424.1781 1449.6150 1451.5189 1464.4997 1562.6199 1591.2616 1634.0402 3004.0912 3105.3872 3139.2685 3147.8980 3157.6582 3174.0487 3188.2315
redmass: 7.6285 3.1703 1.2723 4.5889 3.5202 5.2715 4.9655 9.5919 5.2141 6.6861 3.3940 5.4680 4.8462 6.7034 6.6450 4.8240 2.3094 6.0105 1.7679 1.3711 8.1293 1.3832 7.9044 1.3523 3.5030 2.9409 1.2638 1.7061 1.4623 1.0660 3.6166 1.4074 10.9063 1.9944 1.1848 2.3593 1.0508 1.0515 6.1635 6.4467 10.5490 1.0296 1.1044 1.0866 1.1047 1.0922 1.0964 1.0962
irintensity: 1.4751 1.0852 0.5950 0.7103 6.9588 3.1174 1.7595 0.3358 18.9069 2.0063 2.0490 8.1150 6.8555 8.8027 11.1912 18.9526 45.5572 15.0062 37.2629 0.3462 7.1764 2.4814 101.0613 0.3193 51.2134 113.1387 0.0698 28.7150 60.0468 0.2461 244.1056 7.4054 7.3899 24.9848 25.2703 39.7034 14.6183 12.7167 15.0493 25.2894 165.7518 37.8297 25.9181 2.5076 15.9873 12.5168 10.9685 6.9534
temp: 298.150 k
press: 1.00000 atm
elementType: 53 8 8 6 6 6 6 6 6 6 6 1 1 1 1 1 1 1
symmnumber: 1
zpe: 339086.2 jmol-1
zpe.correction: 0.129151 hartree
zpe.thermalcorrener: 0.139921 hartree
zpe.thermalcorrenthalpy: 0.140865 hartree
zpe.thermalcorrgfe: 0.089558 hartree
zpe.sumelectzpe: -470.202293 hartree
zpe.sumelectthermal: -470.191523 hartree
zpe.sumelectthermalent: -470.190578 hartree
zpe.sumelectthermalfe: -470.241886 hartree
dipole: -2.1835 2.2990 -0.1940
dipole: 3.1766
quadrupole: -64.4094 -67.9844 -81.2226
quadrupole: 4.5260 -0.2242 0.8683
quadrupole: 6.7961 3.2210 -10.0171 4.5260 -0.2242 0.8683
hfenergy: -470.3314438 hartree
pointgroup: C01 [X(C8H7I1O2)]
dipole: -0.3190231 -1.2000238 -0.1416495 debye
dipolederiv: 0.0863576 -0.1159311 -0.0007036 -0.0844949 -0.4769662 -0.0241016 0.0021829 -0.0139339 0.0246385 -1.2544844 0.4550583 0.0976286 0.6785936 -0.8589651 -0.1265004 0.1749498 -0.126758 -0.3256536 -0.8024225 -0.1232877 -0.0368676 -0.015865 -0.7082557 -0.098889 0.0131049 -0.0876719 -0.316367 -0.6527354 -0.0556924 0.0104009 -0.0134374 -0.3782661 -0.0311315 0.0071082 -0.0249997 0.0481217 0.1310644 0.421678 0.0141675 -0.0494491 1.1380189 0.0579741 -0.0215869 0.0441424 -0.149222 0.09925 -0.0119008 -0.0058274 0.1125685 -0.0439586 0.000938 0.0204467 0.0051054 -0.1105406 -0.1173237 -0.2929067 -0.0135271 -0.2685971 -0.4262045 -0.0110257 -0.0143323 -0.0086782 -0.1077603 -0.1917274 0.1865607 0.0103641 0.0950801 0.0367552 0.0088388 0.0063667 0.0092211 -0.1573615 0.1294286 -0.0726234 -0.007433 0.0592283 0.2011158 0.0162933 -0.0003348 0.0161295 -0.1179785 1.8083511 -0.3231944 -0.0599932 -0.45736 1.2416066 0.2396232 -0.1488063 0.2157432 0.2819319 0.7275644 -0.1914324 -0.0369813 -0.0839442 0.2519569 -0.0022149 -0.035417 0.0060121 0.2812376 0.0978939 0.0414402 0.0009148 0.0681073 0.0073932 -0.0082281 -0.0025079 -0.0117038 0.1586485 0.0265867 0.0644808 0.0056459 0.0930097 0.0100143 -0.0091096 0.0077048 -0.0072163 0.1582065 0.0592676 -0.0562849 -0.0013665 -0.0749398 -0.0912918 -0.0121994 -0.0040142 -0.0110641 0.1607303 -0.1006367 -0.0488119 0.0020688 -0.0379826 0.0609761 -0.0041963 0.0020766 -0.0051344 0.1597169 -0.0447774 0.0411028 -0.0178018 -0.0536527 0.0921064 -0.0655342 -0.0819934 -0.0320413 -0.0831062 -0.0327741 0.034403 0.0279453 -0.0796611 0.0304363 0.1161485 0.0511517 0.0772479 -0.0168458 0.0311173 0.047342 0.0113655 0.1127963 -0.0864717 -0.0466854 0.0239005 -0.0443998 0.1116033 unknown
polarizability: 139.7967578|5.5234591|157.1247972|-1.7695455|6.9589001|45.569009 unknown
InChI: InChI=1S/C8H7IO2/c1-11-8(10)6-4-2-3-5-7(6)9/h2-5H,1H3
charge 0 multiplicity 1
18 atoms
I  -0.516246 3.116782 0.117483
O  2.100531 -1.028347 -0.293743
O  2.023247 1.249069 0.154195
C  -0.066751 -0.040407 -0.04468
C  -1.015231 1.021002 0.030358
C  -0.56071 -1.377425 -0.113336
C  -2.402499 0.739469 0.035906
C  -1.938267 -1.656961 -0.103284
C  -2.864528 -0.592398 -0.027891
C  1.415028 0.172505 -0.042677
C  3.576601 -0.917759 -0.297949
H  0.171951 -2.185381 -0.173423
H  -3.120251 1.56251 0.090025
H  -2.286852 -2.693455 -0.153677
H  -3.942069 -0.78861 -0.019385
H  3.93849 -0.576932 0.686815
H  3.904184 -0.200554 -1.069167
H  3.932272 -1.933109 -0.522469
