program: Orca
programVersion: 4.2.1
elementType: S O O O O O O O N N N N N N C C C C C C C C C C C C C C H H H H H H H H H H H H H H H H H H
charge: 0
multiplicity: 1
keywords: wb97x-d3
keywords: def2-TZVPP
keywords: def2/J RIJCOSX GRIDX6 NOFINALGRIDX
keywords: grid4 nofinalgrid
keywords: scfconv7
keywords: smallprint printgap noloewdin
keywords: NOSOSCF
formula: C14H18N6O7S
InChI: InChI=1S/C14H18N6O7S/c1-5-27-12(21)8-7-15-20(2)11(8)28(23,24)19-14(22)18-13-16-9(25-3)6-10(17-13)26-4/h6-7,18-19H,5H2,1-4H3
46 atoms
S  1.97013 -0.737758 -1.288629
O  2.355742 -1.935398 -1.996491
O  2.094224 0.548487 -1.933087
O  1.130378 1.698624 0.532937
O  2.65277 2.536567 1.946059
O  0.653909 -2.785658 0.309224
O  -2.642534 2.109633 -1.553892
O  -5.733536 -0.575063 0.767525
N  3.697069 -1.64825 0.662499
N  0.381274 -0.845959 -0.83153
N  4.281052 -1.307962 1.800828
N  -1.395788 -1.848404 0.283742
N  -2.058688 0.170916 -0.654643
N  -3.561011 -1.217129 0.524173
C  2.851649 -0.688168 0.238737
C  2.906805 0.342493 1.167682
C  3.824606 -0.11571 2.117715
C  4.054745 -2.926186 0.071186
C  2.231971 1.64263 1.252193
C  -0.069174 -1.885263 -0.061081
C  0.436082 2.953228 0.423159
C  -2.371642 -0.909933 0.027311
C  1.069722 3.852635 -0.611453
C  -3.039151 1.052174 -0.8685
C  -4.521681 -0.339812 0.305283
C  -4.324018 0.848708 -0.401865
C  -3.581126 3.141161 -1.826782
C  -5.971585 -1.782284 1.487582
H  4.151202 0.380119 3.018094
H  -0.256535 -0.062932 -1.030922
H  4.708249 -3.419922 0.782142
H  4.589415 -2.786849 -0.864116
H  3.174213 -3.538463 -0.091535
H  0.376961 3.438767 1.398173
H  -0.573191 2.678552 0.124091
H  2.068255 4.178563 -0.321523
H  1.132218 3.358244 -1.580303
H  0.453232 4.744373 -0.730724
H  -5.13831 1.539558 -0.558675
H  -3.040724 3.902398 -2.382779
H  -4.409695 2.780032 -2.438931
H  -3.969465 3.584416 -0.907861
H  -5.777246 -2.661869 0.873926
H  -5.368522 -1.836227 2.393971
H  -7.023944 -1.759214 1.7576
H  -1.701075 -2.638349 0.837007
elementType: S O N C H
totalener: -1797.80124192 hartree
nucrepener: 3087.26975206 hartree
electener: -4885.07099398 hartree
oneelecener: -8603.29665157 hartree
twoeener: 3718.22565759 hartree
cpcmener: -0.04083588 hartree
kineticenergy: 1791.36682289 hartree
xcener: -147.479310958742 hartree
chargesum: -0.0000000
charge: 0.872018 -0.481986 -0.482298 -0.275758 -0.450012 -0.467200 -0.288435 -0.287757 0.186908 -0.190021 -0.316053 -0.133291 -0.400775 -0.432013 -0.108014 -0.066568 -0.058278 -0.157324 0.469688 0.383219 0.033882 0.390085 -0.252911 0.386584 0.363476 -0.274839 -0.135482 -0.117056 0.160217 0.212145 0.115115 0.130768 0.129298 0.103049 0.088572 0.093834 0.090187 0.100028 0.134930 0.127430 0.129044 0.123979 0.113798 0.114451 0.132453 0.190915
qa: 0.8720 -0.4820 -0.4823 -0.2758 -0.4500 -0.4672 -0.2884 -0.2878 0.1869 -0.1900 -0.3161 -0.1333 -0.4008 -0.4320 -0.1080 -0.0666 -0.0583 -0.1573 0.4697 0.3832 0.0339 0.3901 -0.2529 0.3866 0.3635 -0.2748 -0.1355 -0.1171 0.1602 0.2121 0.1151 0.1308 0.1293 0.1030 0.0886 0.0938 0.0902 0.1000 0.1349 0.1274 0.1290 0.1240 0.1138 0.1145 0.1325 0.1909
va: 5.8892 2.0207 2.0129 2.1323 2.0604 2.0475 2.1160 2.1407 3.3657 3.0779 2.8973 3.1824 2.9680 2.9709 4.0657 3.6651 4.1062 3.8495 4.1673 4.3864 3.8357 4.2050 3.9172 4.0706 4.1179 3.8876 3.8534 3.8480 1.0105 1.0688 1.0101 0.9923 1.0005 1.0148 1.0046 1.0119 1.0086 1.0071 1.0178 0.9930 0.9863 0.9857 0.9961 0.9957 0.9935 1.0185
dispcorr: -0.026040513 hartree
energy: -1797.827282433215
dipole: -15.42846 10.74506 -4.68339 11.87819 -11.06860 0.80958 0.56541 -0.36322 0.20219
magnitude: 4.75715 au
magnitude: 12.09172 debye
