program: Orca
programVersion: 4.2.1
elementType: S O O O O O O O N N N N N N C C C C C C C C C C C C C C H H H H H H H H H H H H H H H H H H
charge: 0
multiplicity: 1
keywords: wb97x-d3
keywords: def2-TZVPP
keywords: def2/J RIJCOSX GRIDX6 NOFINALGRIDX
keywords: grid4 nofinalgrid
keywords: scfconv7
keywords: smallprint printgap noloewdin
keywords: NOSOSCF
formula: C14H18N6O7S
InChI: InChI=1S/C14H18N6O7S/c1-5-27-12(21)8-7-15-20(2)11(8)28(23,24)19-14(22)18-13-16-9(25-3)6-10(17-13)26-4/h6-7,18-19H,5H2,1-4H3
46 atoms
S  1.673358 -1.623754 0.691811
O  1.51937 -1.26942 2.07936
O  2.191473 -2.911806 0.309441
O  1.937709 3.069888 0.774232
O  0.527362 1.375898 1.150269
O  0.80549 -1.728879 -2.137439
O  -3.360868 -0.007313 2.251347
O  -5.643881 0.324867 -1.777279
N  3.702782 -0.648725 -0.907816
N  0.170474 -1.398313 0.02316
N  4.307547 0.462286 -1.301557
N  -1.327494 -1.1185 -1.730596
N  -2.326022 -0.569703 0.295582
N  -3.482808 -0.404302 -1.75499
C  2.653987 -0.38739 -0.106421
C  2.579069 0.991898 0.024005
C  3.650004 1.457638 -0.750004
C  4.206212 -1.913516 -1.413163
C  1.569064 1.794154 0.716517
C  -0.043182 -1.443648 -1.328649
C  1.023146 3.991649 1.372035
C  -2.421002 -0.6798 -1.017683
C  1.630931 5.370407 1.275554
C  -3.403303 -0.133699 0.940937
C  -4.549388 0.027653 -1.098699
C  -4.578812 0.189936 0.281189
C  -2.151007 -0.3184 2.935232
C  -5.630116 0.166951 -3.186641
H  3.95114 2.477189 -0.927202
H  -0.56558 -0.998285 0.61608
H  3.423561 -2.445244 -1.944511
H  4.583352 -2.535114 -0.606716
H  5.01436 -1.66426 -2.091683
H  0.845415 3.712332 2.413066
H  0.061689 3.949533 0.854732
H  2.581729 5.427511 1.804394
H  1.795495 5.663907 0.239155
H  0.954882 6.09763 1.724518
H  -5.454885 0.543103 0.802752
H  -1.331259 0.32745 2.622763
H  -2.361943 -0.151748 3.987849
H  -1.861615 -1.360342 2.79185
H  -4.874029 0.795401 -3.657833
H  -5.450527 -0.868575 -3.476579
H  -6.616675 0.471783 -3.525345
H  -1.467007 -1.162398 -2.728813
totalener: -1797.78194531 hartree
nucrepener: 3066.36080731 hartree
electener: -4864.14275262 hartree
oneelecener: -8561.25562061 hartree
twoeener: 3697.11286799 hartree
kineticenergy: 1791.42651509 hartree
xcener: -147.482124636883 hartree
chargesum: 0.0000000
charge: 0.852925 -0.436028 -0.438083 -0.268831 -0.415503 -0.394541 -0.262590 -0.264275 0.182819 -0.206214 -0.279947 -0.163588 -0.414849 -0.408610 -0.115975 -0.094851 -0.054186 -0.173406 0.478272 0.349962 0.027118 0.358869 -0.235530 0.402175 0.384699 -0.305593 -0.136807 -0.124730 0.139834 0.219901 0.137857 0.123745 0.114025 0.089413 0.086971 0.088031 0.084425 0.081239 0.128252 0.126356 0.125428 0.105824 0.107297 0.108346 0.123058 0.167293
qa: 0.8529 -0.4360 -0.4381 -0.2688 -0.4155 -0.3945 -0.2626 -0.2643 0.1828 -0.2062 -0.2799 -0.1636 -0.4148 -0.4086 -0.1160 -0.0949 -0.0542 -0.1734 0.4783 0.3500 0.0271 0.3589 -0.2355 0.4022 0.3847 -0.3056 -0.1368 -0.1247 0.1398 0.2199 0.1379 0.1237 0.1140 0.0894 0.0870 0.0880 0.0844 0.0812 0.1283 0.1264 0.1254 0.1058 0.1073 0.1083 0.1231 0.1673
va: 5.9145 2.0662 2.0659 2.1411 2.0762 2.1189 2.1621 2.1481 3.3520 3.0978 2.8978 3.1651 2.9710 2.9723 4.0721 3.7162 4.0955 3.8612 4.1091 4.3924 3.8747 4.2467 3.9614 4.0223 4.0562 3.9387 3.8576 3.8774 1.0136 1.0483 0.9978 0.9946 1.0090 0.9975 0.9997 1.0045 1.0045 1.0085 1.0223 0.9997 0.9951 0.9961 0.9970 0.9968 0.9942 1.0364
dispcorr: -0.025060819 hartree
energy: -1797.807006128205
dipole: -4.92678 3.62900 -1.29778 16.91428 -15.42909 1.48519 0.10952 -0.58140 -0.47187
magnitude: 2.02798 au
magnitude: 5.15472 debye
