program: Orca
programVersion: 4.2.1
elementType: S O O O O O O O N N N N N N C C C C C C C C C C C C C C H H H H H H H H H H H H H H H H H H
charge: 0
multiplicity: 1
keywords: wb97x-d3
keywords: def2-TZVPP
keywords: def2/J RIJCOSX GRIDX6 NOFINALGRIDX
keywords: grid4 nofinalgrid
keywords: scfconv7
keywords: smallprint printgap noloewdin
keywords: NOSOSCF
formula: C14H18N6O7S
InChI: InChI=1S/C14H18N6O7S/c1-5-27-12(21)8-7-15-20(2)11(8)28(23,24)19-14(22)18-13-16-9(25-3)6-10(17-13)26-4/h6-7,18-19H,5H2,1-4H3
46 atoms
S  1.701769 -1.483926 0.953003
O  1.606148 -0.860877 2.247965
O  2.19613 -2.829147 0.813053
O  1.991432 3.129785 0.082509
O  0.594747 1.564139 0.855493
O  0.718588 -2.149421 -1.759738
O  -3.254968 0.512619 2.331396
O  -5.683389 0.0650 -1.600339
N  3.672929 -0.871619 -0.881691
N  0.175267 -1.373372 0.30995
N  4.267552 0.130872 -1.511472
N  -1.389897 -1.431127 -1.406624
N  -2.302809 -0.461076 0.498813
N  -3.533559 -0.689748 -1.502128
C  2.656853 -0.442814 -0.110998
C  2.593189 0.935573 -0.2567
C  3.636166 1.224253 -1.146681
C  4.152603 -2.217661 -1.139738
C  1.616903 1.873293 0.300802
C  -0.093798 -1.689938 -0.99521
C  1.111873 4.165076 0.527828
C  -2.449109 -0.83334 -0.760694
C  1.712679 5.487611 0.116124
C  -3.348538 0.120894 1.077253
C  -4.568851 -0.110619 -0.912166
C  -4.543817 0.32874 0.405864
C  -2.02717 0.316606 3.025604
C  -5.719992 -0.369132 -2.950274
H  3.935318 2.184219 -1.534775
H  -0.531147 -0.846981 0.836141
H  3.347759 -2.838502 -1.520006
H  4.561769 -2.666458 -0.239449
H  4.932559 -2.119389 -1.886646
H  0.994433 4.107261 1.612405
H  0.122294 4.028734 0.085311
H  2.694455 5.639094 0.563628
H  1.812871 5.562361 -0.966357
H  1.065938 6.299627 0.447641
H  -5.393888 0.799667 0.874781
H  -2.194055 0.706698 4.025803
H  -1.76705 -0.740519 3.095891
H  -1.205031 0.857555 2.558194
H  -5.557069 -1.443813 -3.035243
H  -6.715817 -0.12394 -3.309928
H  -4.976538 0.144165 -3.560808
H  -1.568166 -1.674396 -2.369393
totalener: -1797.78216690 hartree
nucrepener: 3066.58660186 hartree
electener: -4864.36876876 hartree
oneelecener: -8561.70105960 hartree
twoeener: 3697.33229085 hartree
kineticenergy: 1791.42442526 hartree
xcener: -147.481807288350 hartree
chargesum: -0.0000000
charge: 0.853169 -0.435728 -0.437731 -0.268728 -0.416349 -0.393766 -0.262517 -0.264170 0.182512 -0.205781 -0.280318 -0.162817 -0.414839 -0.408866 -0.117805 -0.093631 -0.054166 -0.172587 0.478788 0.349235 0.027191 0.358721 -0.234699 0.401981 0.384311 -0.304639 -0.138189 -0.125330 0.139989 0.220137 0.138188 0.122860 0.114214 0.089514 0.086558 0.087565 0.084279 0.081210 0.127500 0.125563 0.106744 0.125966 0.108449 0.123389 0.107456 0.167170
qa: 0.8532 -0.4357 -0.4377 -0.2687 -0.4163 -0.3938 -0.2625 -0.2642 0.1825 -0.2058 -0.2803 -0.1628 -0.4148 -0.4089 -0.1178 -0.0936 -0.0542 -0.1726 0.4788 0.3492 0.0272 0.3587 -0.2347 0.4020 0.3843 -0.3046 -0.1382 -0.1253 0.1400 0.2201 0.1382 0.1229 0.1142 0.0895 0.0866 0.0876 0.0843 0.0812 0.1275 0.1256 0.1067 0.1260 0.1084 0.1234 0.1075 0.1672
va: 5.9151 2.0664 2.0659 2.1408 2.0756 2.1193 2.1621 2.1483 3.3518 3.0962 2.8976 3.1640 2.9713 2.9719 4.0731 3.7150 4.0960 3.8613 4.1056 4.3925 3.8754 4.2471 3.9613 4.0226 4.0565 3.9390 3.8573 3.8773 1.0135 1.0479 0.9978 0.9947 1.0091 0.9975 0.9998 1.0046 1.0044 1.0088 1.0224 0.9954 0.9956 0.9996 0.9967 0.9941 0.9969 1.0364
dispcorr: -0.025054472 hartree
energy: -1797.807221366932
dipole: -4.79876 3.50171 -1.29706 16.73224 -15.33900 1.39324 -3.11758 2.40484 -0.71274
magnitude: 2.03261 au
magnitude: 5.16647 debye
