program: Orca
programVersion: 4.2.1
elementType: S O O O O O O O N N N N N N C C C C C C C C C C C C C C H H H H H H H H H H H H H H H H H H
charge: 0
multiplicity: 1
keywords: wb97x-d3
keywords: def2-TZVPP
keywords: def2/J RIJCOSX GRIDX6 NOFINALGRIDX
keywords: grid4 nofinalgrid
keywords: scfconv7
keywords: smallprint printgap noloewdin
keywords: NOSOSCF
formula: C14H18N6O7S
InChI: InChI=1S/C14H18N6O7S/c1-5-27-12(21)8-7-15-20(2)11(8)28(23,24)19-14(22)18-13-16-9(25-3)6-10(17-13)26-4/h6-7,18-19H,5H2,1-4H3
46 atoms
S  1.732215 -1.496996 1.020148
O  1.644395 -0.837056 2.297488
O  2.240503 -2.840245 0.914325
O  1.897553 3.082558 -0.077654
O  0.572782 1.525248 0.826755
O  0.734274 -2.22122 -1.671946
O  -3.191448 0.554817 2.385325
O  -5.589973 0.206858 -1.574125
N  3.68297 -0.916027 -0.845672
N  0.197842 -1.422694 0.391173
N  4.250395 0.070939 -1.523427
N  -1.363029 -1.464233 -1.330142
N  -2.260594 -0.460912 0.564798
N  -3.475009 -0.638134 -1.450945
C  2.662479 -0.477029 -0.086742
C  2.565375 0.891794 -0.293552
C  3.595212 1.164246 -1.203774
C  4.190008 -2.261174 -1.050853
C  1.570796 1.83102 0.227602
C  -0.072848 -1.743316 -0.913266
C  0.988611 4.113694 0.315817
C  -2.40606 -0.82522 -0.696868
C  1.529391 5.425067 -0.200958
C  -3.286554 0.166916 1.130184
C  -4.491858 -0.015536 -0.873232
C  -4.463479 0.425101 0.444279
C  -1.983036 0.303186 3.095249
C  -5.63199 -0.230354 -2.922844
H  3.86952 2.112366 -1.63664
H  -0.504192 -0.882094 0.909182
H  3.399318 -2.911448 -1.411501
H  4.602719 -2.668264 -0.132614
H  4.971872 -2.175507 -1.797285
H  0.89565 4.12755 1.404182
H  -0.003722 3.910019 -0.093273
H  0.856383 6.233357 0.084078
H  2.511665 5.6461 0.215212
H  1.608155 5.424907 -1.287765
H  -5.298066 0.932803 0.902482
H  -1.770439 -0.76455 3.164439
H  -1.132142 0.809909 2.64109
H  -2.146448 0.696597 4.094714
H  -4.85491 0.240108 -3.525907
H  -5.524792 -1.312576 -3.001325
H  -6.608968 0.064966 -3.29604
H  -1.53995 -1.706136 -2.293502
totalener: -1797.78191352 hartree
nucrepener: 3075.70978336 hartree
electener: -4873.49169688 hartree
oneelecener: -8579.93417838 hartree
twoeener: 3706.44248150 hartree
kineticenergy: 1791.42664452 hartree
xcener: -147.482121940059 hartree
chargesum: 0.0000000
charge: 0.854625 -0.435707 -0.438061 -0.268951 -0.416225 -0.391199 -0.262188 -0.264116 0.182747 -0.205920 -0.280201 -0.162897 -0.411991 -0.408113 -0.120650 -0.091405 -0.054927 -0.171609 0.478852 0.345491 0.026780 0.356499 -0.235309 0.403350 0.383933 -0.305262 -0.138370 -0.125010 0.140422 0.218386 0.137199 0.122881 0.114219 0.090109 0.086587 0.081426 0.087824 0.084441 0.127519 0.107033 0.125777 0.125942 0.107121 0.108575 0.123174 0.167198
qa: 0.8546 -0.4357 -0.4381 -0.2690 -0.4162 -0.3912 -0.2622 -0.2641 0.1827 -0.2059 -0.2802 -0.1629 -0.4120 -0.4081 -0.1206 -0.0914 -0.0549 -0.1716 0.4789 0.3455 0.0268 0.3565 -0.2353 0.4033 0.3839 -0.3053 -0.1384 -0.1250 0.1404 0.2184 0.1372 0.1229 0.1142 0.0901 0.0866 0.0814 0.0878 0.0844 0.1275 0.1070 0.1258 0.1259 0.1071 0.1086 0.1232 0.1672
va: 5.9130 2.0659 2.0655 2.1410 2.0746 2.1212 2.1623 2.1481 3.3524 3.0943 2.8981 3.1635 2.9708 2.9726 4.0762 3.7058 4.0971 3.8617 4.1061 4.3956 3.8754 4.2502 3.9609 4.0207 4.0564 3.9401 3.8572 3.8774 1.0135 1.0517 0.9979 0.9949 1.0091 0.9974 0.9998 1.0087 1.0045 1.0043 1.0224 0.9949 0.9989 0.9955 0.9971 0.9965 0.9941 1.0363
dispcorr: -0.025246977 hartree
energy: -1797.807160497720
dipole: -5.23231 3.91309 -1.31922 16.72437 -15.32810 1.39627 -4.01928 3.24783 -0.77146
magnitude: 2.07004 au
magnitude: 5.26161 debye
