program: Gaussian 09
title: 000069131
version: EM64L-G09RevD.01
frameworkgroup: C1[X(C8H6O6)]
method: RPBEPBE
basis: SDD
operation: Freq
keyword: #p
keyword: freq=noraman
keyword: PBEPBE/SDD
title: #p freq=noraman PBEPBE/SDD
converged: YES YES NO YES
title: Mulliken charges:
elementType: O O O O O O C C C C C C C C H H H H H H
charge: -0.401895 -0.401894 -0.414501 -0.414500 -0.315471 -0.315474 0.171734 0.171731 0.148962 0.148964 -0.448795 -0.448796 0.173504 0.173505 0.298954 0.298953 0.391090 0.391090 0.396419 0.396420
chargesum: 0.00000
title: Mulliken charges with hydrogens summed into heavy atoms:
elementType: O O O O O O C C C C C C C C
charge: -0.010804 -0.010804 -0.018082 -0.018081 -0.315471 -0.315474 0.171734 0.171731 0.148962 0.148964 -0.149841 -0.149843 0.173504 0.173505
polarizability: 1.82120339e+02 3.90049599e+00 1.27475575e+02 -3.03411339e-03 -2.14025102e-03 4.28963583e+01
1716.lowfreq: -3.9386 -0.0010 -0.0010 -0.0009 9.1081 10.6780 63.3948 94.1910 106.7584
frequency: 63.3948 94.1910 106.7544 165.3895 173.1723 206.4389 234.8912 307.6719 357.5079 373.2566 395.6846 427.9577 437.9130 464.6824 494.8314 554.7478 577.2277 585.8385 617.0003 650.5995 679.1476 680.6454 720.2322 758.5693 759.9961 794.4418 797.3207 820.6086 904.3935 909.7054 993.1865 1029.7731 1116.2268 1129.9893 1196.0973 1220.0320 1259.2903 1271.1553 1312.3455 1378.4413 1408.6682 1421.5388 1436.7448 1480.3866 1548.6852 1568.9517 1607.9485 1676.8654 3118.3048 3125.3029 3191.8337 3193.8760 3528.7632 3529.0961
redmass: 7.5666 12.5975 10.9470 7.9060 9.0091 5.6364 6.4932 10.3747 6.2545 7.4461 9.5703 3.0759 9.2934 9.7871 7.0854 2.3042 4.5244 1.2272 1.6849 4.6549 5.0188 4.5532 6.3134 6.8818 2.4892 1.1182 1.2387 4.5636 1.6284 1.4666 10.3263 3.8598 1.8186 1.4928 3.6863 1.2360 1.6538 6.4603 1.7859 4.0245 7.4085 2.9342 2.8986 3.6060 4.2841 7.8152 4.2200 6.0190 1.0674 1.0674 1.0923 1.0926 1.0642 1.0642
irintensity: 2.0123 0.0608 0.0000 1.8107 0.1024 0.0000 0.0001 0.0001 24.7475 0.0002 0.0000 32.7943 3.8818 0.0000 52.2345 42.4131 0.0000 0.0003 243.1626 0.0022 63.7022 0.0080 0.0002 2.9907 0.0002 376.0799 0.0038 88.5604 0.0000 21.4968 0.0000 579.7691 0.0000 403.5742 19.0769 0.0000 352.6766 0.0002 0.0000 329.3972 81.2668 0.0000 166.9491 389.8846 0.0002 0.0000 396.0799 0.0000 460.7317 0.0032 4.8776 0.0000 163.2803 0.0493
temp: 298.150 k
press: 1.00000 atm
elementType: 8 8 8 8 8 8 6 6 6 6 6 6 6 6 1 1 1 1 1 1
symmnumber: 1
zpe: 352047.3 jmol-1
zpe.correction: 0.134088 hartree
zpe.thermalcorrener: 0.145836 hartree
zpe.thermalcorrenthalpy: 0.146780 hartree
zpe.thermalcorrgfe: 0.096191 hartree
zpe.sumelectzpe: -758.820514 hartree
zpe.sumelectthermal: -758.808766 hartree
zpe.sumelectthermalent: -758.807822 hartree
zpe.sumelectthermalfe: -758.858411 hartree
dipole: 0.0000 0.0000 0.0044
dipole: 0.0044
quadrupole: -62.7247 -87.1839 -80.5305
quadrupole: 15.8488 0.0029 0.0005
quadrupole: 14.0884 -10.3708 -3.7175 15.8488 0.0029 0.0005
hfenergy: -758.9546019 hartree
pointgroup: C01 [X(C8H6O6)]
dipole: -0.0000663 0.0000454 0.0017345 debye
dipolederiv: -0.7056143 0.5674267 -0.0259753 0.4560329 -0.9318755 0.0300464 -0.02329 0.0343946 -0.3955308 -0.7056207 0.5673986 -0.025881 0.4559996 -0.9318368 0.030874 -0.0232558 0.0351938 -0.3955656 -0.6660074 -0.4556439 0.0019665 -0.7274036 -1.0764466 -0.0105806 0.0082891 -0.0010187 -0.4092954 -0.6660225 -0.4556942 0.0017327 -0.727394 -1.0764214 -0.0106157 0.0087741 0.000047 -0.4093118 -1.14407 0.1821405 -0.0343101 0.2555162 -0.7364702 0.0191619 -0.0372499 0.0168028 -0.3532081 -1.1441522 0.1821656 -0.0341482 0.2555661 -0.7364839 0.0191672 -0.0352298 0.0161845 -0.3531126 -0.977046 -0.3621376 -0.0269921 0.2537823 0.0631215 0.0072902 -0.04237 -0.0157786 -0.0208021 -0.9770801 -0.3621398 -0.0265427 0.2537793 0.0631264 0.0074287 -0.0420537 -0.0155311 -0.0207847 0.316452 -0.9646948 0.0335494 -0.5216244 0.5893571 -0.0323031 0.0225226 -0.0490117 0.0644293 0.3164234 -0.9646598 0.0339379 -0.5215799 0.5893256 -0.0330817 0.0229964 -0.0496703 0.0644991 0.20991 0.626376 -0.0040444 -0.2504937 -0.1092021 -0.0093164 0.0182739 0.0235891 -0.1070388 0.2099219 0.6263928 -0.0038688 -0.2505083 -0.1092086 -0.0092596 0.0178201 0.0232357 -0.1070427 2.1669486 0.3451202 0.0631698 0.415317 1.4020627 -0.0130524 0.0623792 -0.0155426 0.2658756 2.1670768 0.3451043 0.0622397 0.4152479 1.4020687 -0.0126913 0.059969 -0.0155662 0.2657424 0.1137933 -0.0157722 -0.001741 -0.0163018 0.0551923 0.0023446 -0.0016916 0.0023746 0.1717476 0.1137937 -0.0157721 -0.0017729 -0.0163014 0.0551908 0.0023409 -0.0016822 0.0023296 0.1717479 0.4527222 -0.017924 0.0034298 -0.0417956 0.4069403 -0.0020369 0.0042636 -0.0010043 0.3770806 0.4527618 -0.0179027 0.0031777 -0.0417937 0.4069121 -0.002512 0.003548 -0.0016812 0.3770729 0.2329173 0.0951016 -0.0091338 0.1769681 0.3373265 0.008485 -0.011228 0.0053687 0.4067303 0.2328922 0.0951148 -0.0087932 0.1769868 0.3373209 0.0083106 -0.0107849 0.0052842 0.406767 unknown
polarizability: 181.8682488|4.4103292|127.4877719|5.0910716|-1.9618092|43.136252 unknown
InChI: InChI=1S/C8H6O6/c9-5-1-3(7(11)12)6(10)2-4(5)8(13)14/h1-2,9-11,13H
charge 0 multiplicity 1
20 atoms
O  -1.610412 2.304342 -0.117643
O  1.610416 -2.304253 0.118736
O  -3.341566 -1.598888 -0.085898
O  3.341669 1.598909 0.084444
O  -3.667352 0.691691 -0.156397
O  3.667522 -0.691717 0.153028
C  -1.402104 -0.168456 -0.04799
C  1.402144 0.168519 0.048124
C  -0.837952 1.159487 -0.060211
C  0.837984 -1.159419 0.06055
C  -0.56161 -1.30478 0.012165
C  0.561646 1.304845 -0.011964
C  -2.86633 -0.29843 -0.099926
C  2.866386 0.298483 0.099595
H  -0.993435 -2.307823 0.021491
H  0.993471 2.307889 -0.021255
H  -2.588602 2.034776 -0.14669
H  2.588555 -2.034648 0.149196
H  -4.33573 -1.588952 -0.124549
H  4.3359 1.588927 0.121293
