program: Orca
programVersion: 4.2.1
elementType: S O O O O O O O N N N N N N C C C C C C C C C C C C C C H H H H H H H H H H H H H H H H H H
charge: 0
multiplicity: 1
keywords: wb97x-d3
keywords: def2-TZVPP
keywords: def2/J RIJCOSX GRIDX6 NOFINALGRIDX
keywords: grid4 nofinalgrid
keywords: scfconv7
keywords: smallprint printgap noloewdin
keywords: NOSOSCF
formula: C14H18N6O7S
InChI: InChI=1S/C14H18N6O7S/c1-5-27-12(21)8-7-15-20(2)11(8)28(23,24)19-14(22)18-13-16-9(25-3)6-10(17-13)26-4/h6-7,18-19H,5H2,1-4H3
46 atoms
S  1.805325 -0.714525 -1.429332
O  2.25378 -1.907351 -2.099541
O  1.816543 0.561498 -2.097792
O  2.385937 2.626268 1.770323
O  0.825719 1.781662 0.402057
O  0.584757 -2.828942 0.258552
O  -5.886926 -0.853668 0.665868
O  -3.02241 1.959869 -1.664071
N  3.632609 -1.45234 0.508512
N  0.238636 -0.910603 -0.917013
N  4.237883 -1.033256 1.609233
N  -1.495584 -1.959727 0.217781
N  -3.686803 -1.409964 0.438569
N  -2.23384 0.022518 -0.748307
C  2.715066 -0.566473 0.078154
C  2.734686 0.499159 0.965173
C  3.717068 0.139502 1.896221
C  4.0094 -2.74863 -0.026608
C  1.872965 1.683264 0.986688
C  -0.155378 -1.95828 -0.128664
C  1.657367 3.849211 1.90974
C  -2.508747 -1.067048 -0.052427
C  1.887441 4.786866 0.743693
C  -4.682553 -0.568622 0.202813
C  -3.242273 0.858674 -0.975206
C  -4.525902 0.611822 -0.513476
C  -6.064633 -2.058412 1.393158
C  -1.703779 2.231884 -2.127155
H  4.046953 0.687345 2.763807
H  -0.419367 -0.137886 -1.066235
H  4.698135 -3.180316 0.691222
H  4.501638 -2.644732 -0.989361
H  3.135113 -3.382392 -0.132723
H  2.033046 4.286663 2.834098
H  0.593594 3.642617 2.04161
H  1.487062 4.383475 -0.18453
H  1.387718 5.736149 0.938616
H  2.948528 4.991607 0.604523
H  -5.34533 1.289033 -0.69827
H  -5.45157 -2.082228 2.294445
H  -7.115497 -2.0815 1.669073
H  -5.828348 -2.934757 0.788982
H  -1.350418 1.46477 -2.81751
H  -1.77168 3.17856 -2.655803
H  -0.995424 2.324935 -1.304872
H  -1.771193 -2.74995 0.781235
totalener: -1797.78180002 hartree
nucrepener: 3065.29518242 hartree
electener: -4863.07698243 hartree
oneelecener: -8559.13871577 hartree
twoeener: 3696.06173334 hartree
kineticenergy: 1791.42420024 hartree
xcener: -147.482808981690 hartree
chargesum: 0.0000000
charge: 0.851713 -0.437150 -0.439459 -0.271493 -0.419569 -0.398954 -0.263840 -0.263491 0.182035 -0.204489 -0.280784 -0.163089 -0.408851 -0.418881 -0.118551 -0.096483 -0.054833 -0.173938 0.483890 0.356113 0.027874 0.361050 -0.252036 0.383820 0.399689 -0.302043 -0.126117 -0.134855 0.140474 0.221694 0.113876 0.122658 0.139389 0.099250 0.085860 0.097344 0.082596 0.089041 0.128529 0.107776 0.124065 0.108356 0.108140 0.124985 0.121548 0.167144
qa: 0.8517 -0.4372 -0.4395 -0.2715 -0.4196 -0.3990 -0.2638 -0.2635 0.1820 -0.2045 -0.2808 -0.1631 -0.4089 -0.4189 -0.1186 -0.0965 -0.0548 -0.1739 0.4839 0.3561 0.0279 0.3611 -0.2520 0.3838 0.3997 -0.3020 -0.1261 -0.1349 0.1405 0.2217 0.1139 0.1227 0.1394 0.0992 0.0859 0.0973 0.0826 0.0890 0.1285 0.1078 0.1241 0.1084 0.1081 0.1250 0.1215 0.1671
va: 5.9162 2.0673 2.0635 2.1442 2.0712 2.1152 2.1489 2.1615 3.3514 3.0993 2.8958 3.1655 2.9714 2.9731 4.0670 3.7134 4.0977 3.8621 4.1156 4.3869 3.8688 4.2439 3.9184 4.0572 4.0261 3.9373 3.8769 3.8623 1.0134 1.0437 1.0091 0.9942 0.9983 0.9955 1.0125 1.0115 1.0092 1.0057 1.0222 0.9968 0.9938 0.9968 0.9971 0.9953 0.9995 1.0366
dispcorr: -0.025273174 hartree
energy: -1797.807073190146
dipole: -4.71749 3.39847 -1.31902 12.60528 -11.82893 0.77635 5.90406 -4.82766 1.07639
magnitude: 1.87113 au
magnitude: 4.75604 debye
