program: Gaussian 09
title: 000074120
version: EM64L-G09RevD.01
frameworkgroup: C1[X(C4H9NO2)]
method: RPBEPBE
basis: SDD
operation: Freq
keyword: #pfreq=noraman
keyword: PBEPBE/SDD
title: #p freq=noraman PBEPBE/SDD
converged: YES YES NO NO
title: Mulliken charges:
elementType: O O N C C C C H H H H H H H H H
charge: -0.420844 -0.267809 -0.046278 -0.397975 -0.301820 -0.624955 -0.039472 0.214157 0.220517 0.199750 0.230547 0.250848 0.219367 0.275208 0.151912 0.336847
chargesum: 0.00000
title: Mulliken charges with hydrogens summed into heavy atoms:
elementType: O O N C C C C
charge: -0.083997 -0.267809 -0.046278 0.036699 0.128477 0.120468 0.112440
polarizability: 6.65088120e+01 7.32410274e+00 5.73333205e+01 6.17542110e+00 -2.15186359e+00 4.78258012e+01
1716.lowfreq: -11.3529 -7.8105 -0.0006 -0.0005 0.0006 17.5993 32.6759 78.9484 140.0002
frequency: 32.3633 78.9400 139.9710 212.5790 260.1737 296.6375 305.0413 361.3992 395.7795 508.7560 631.8257 826.9233 841.3514 944.1346 960.7592 1003.8479 1048.7671 1076.3657 1121.9611 1145.4830 1232.2178 1257.0596 1315.1912 1357.5943 1379.2700 1382.2751 1395.5532 1422.1608 1451.3434 1468.9365 1473.7541 1500.8864 1633.9484 2910.9655 2946.9666 2963.9756 2977.1334 3019.9738 3058.3059 3083.6047 3108.0877 3562.7246
redmass: 3.9143 4.3435 1.1545 1.6822 4.1822 1.4697 2.5696 2.3838 2.0648 3.3513 3.1092 3.7541 2.4914 2.1642 1.6033 1.7423 2.7929 1.7803 1.3063 1.2931 1.5736 2.0716 1.3950 1.3220 1.3498 1.4154 1.5956 1.1803 1.0966 1.0765 1.0974 1.0755 6.3751 1.0847 1.0642 1.0675 1.0353 1.0985 1.1021 1.0941 1.0986 1.0663
irintensity: 4.6543 0.2022 3.3638 20.4640 14.1017 123.7320 38.1285 21.2179 3.0800 30.4075 3.7215 1.7793 18.3654 5.8717 0.6166 78.2434 12.0210 75.7114 14.0739 28.3456 8.3547 13.2516 16.9158 6.9196 7.1785 5.0019 50.7508 46.4266 20.4409 4.1030 17.6346 14.8422 380.6020 100.5008 10.8717 128.3194 42.2909 21.3052 32.8246 32.6585 1.9681 5.1911
temp: 298.150 k
press: 1.00000 atm
elementType: 8 8 7 6 6 6 6 1 1 1 1 1 1 1 1 1
symmnumber: 1
zpe: 347485.2 jmol-1
zpe.correction: 0.132350 hartree
zpe.thermalcorrener: 0.140834 hartree
zpe.thermalcorrenthalpy: 0.141778 hartree
zpe.thermalcorrgfe: 0.098569 hartree
zpe.sumelectzpe: -362.426985 hartree
zpe.sumelectthermal: -362.418501 hartree
zpe.sumelectthermalent: -362.417557 hartree
zpe.sumelectthermalfe: -362.460766 hartree
dipole: 3.8354 1.2918 3.1264
dipole: 5.1141
quadrupole: -54.8952 -37.0963 -44.0719
quadrupole: -4.0010 2.8813 -3.3991
quadrupole: -9.5407 8.2581 1.2826 -4.0010 2.8813 -3.3991
hfenergy: -362.5593351 hartree
pointgroup: C01 [X(C4H9N1O2)]
dipole: 1.5696393 -0.7998494 -0.9719875 debye
dipolederiv: -0.6600794 -0.0559237 -0.0461241 -0.1070885 -0.5972311 -0.3163504 -0.0999352 -0.262446 -0.29331 -1.1880545 0.4146565 0.0448445 0.1814543 -0.5210056 0.0525243 0.320353 -0.105703 -0.4335514 -0.9032692 0.2541524 0.0153139 0.4836499 -0.7314124 0.1077753 -0.1161849 0.1372647 -0.4477659 0.5333126 -0.0916847 -0.1437298 -0.0251363 0.1686377 0.0636673 -0.2375983 0.0789428 0.1836587 0.3277194 0.0428136 0.0119812 0.0344377 0.5703668 0.1816308 0.0070025 0.1421247 0.3170783 -0.0283376 0.1346784 0.0192217 0.0553221 0.3139363 -0.0581452 0.0647802 -0.0770205 0.3008421 1.46773 -0.7010959 -0.1315223 -0.7173139 0.8211931 -0.2488051 -0.1713749 -0.2026287 0.3868129 0.0330397 0.0008051 -0.018043 -0.0420533 -0.0249252 0.1656344 0.0397257 0.0908101 -0.0217802 -0.038765 0.0065466 0.0040883 0.0796712 -0.1341191 -0.1527085 0.0426076 -0.1040673 0.032362 -0.1895017 0.054695 0.1124906 -0.0001147 0.0054915 -0.0505376 0.1285838 -0.0842043 -0.0408429 0.1105807 -0.025721 0.0130026 0.0011251 -0.0688447 0.0606073 -0.0275185 0.0933594 -0.0363574 0.0459851 -0.015607 -0.1411342 -0.0221075 0.033404 -0.0141186 -0.1098118 0.0377188 -0.0788708 0.122619 0.0738898 0.0191101 0.0380622 -0.1532366 -0.0215462 0.0113763 -0.0870844 0.0192471 -0.0214391 -0.0524823 0.0721431 0.0409952 0.1501773 -0.0178006 0.0119809 0.0088424 0.1142788 -0.0245659 -0.1004563 0.1721644 -0.0559039 -0.0151798 0.1326601 0.1178378 0.1648351 -0.0864732 0.4130258 0.0607336 -0.003807 0.0550005 0.1827476 0.1155126 0.0181756 0.1692563 0.0846719 unknown
polarizability: 66.6864486|-8.4135356|56.3901979|-3.1772345|-4.5189481|48.5912872 unknown
InChI: InChI=1S/C4H9NO2/c1-5(4-7)2-3-6/h4,6H,2-3H2,1H3
charge 0 multiplicity 1
16 atoms
O  2.004398 0.912928 0.833197
O  -2.475465 0.768519 -0.076998
N  -0.457637 -0.429384 -0.267624
C  0.86552 -0.521081 -0.897319
C  2.051346 -0.339961 0.079318
C  -0.818455 -1.402602 0.774274
C  -1.334209 0.596002 -0.587457
H  0.918333 0.249472 -1.692302
H  0.981611 -1.50973 -1.391421
H  2.994863 -0.435778 -0.501263
H  2.04573 -1.125096 0.852862
H  -0.237362 -1.232889 1.699636
H  -0.640455 -2.433803 0.416244
H  -1.887896 -1.269582 1.003163
H  -0.918293 1.267564 -1.375564
H  1.966172 1.679522 0.206855
