program: Orca
programVersion: 4.2.1
elementType: S O O O O O O O N N N N N N C C C C C C C C C C C C C C H H H H H H H H H H H H H H H H H H
charge: 0
multiplicity: 1
keywords: wb97x-d3
keywords: def2-TZVPP
keywords: def2/J RIJCOSX GRIDX6 NOFINALGRIDX
keywords: grid4 nofinalgrid
keywords: scfconv7
keywords: smallprint printgap noloewdin
keywords: NOSOSCF
formula: C14H18N6O7S
InChI: InChI=1S/C14H18N6O7S/c1-5-27-12(21)8-7-15-20(2)11(8)28(23,24)19-14(22)18-13-16-9(25-3)6-10(17-13)26-4/h6-7,18-19H,5H2,1-4H3
46 atoms
S  1.784666 -0.920021 -1.481574
O  2.241792 -2.192953 -1.975936
O  1.786317 0.247543 -2.325026
O  2.211969 2.776744 1.368625
O  0.753632 1.786095 -0.006807
O  0.601062 -2.759325 0.517208
O  -3.036713 1.725278 -1.989927
O  -5.775922 -0.519137 1.011039
N  3.628857 -1.353947 0.529749
N  0.220583 -1.053381 -0.940868
N  4.211687 -0.790344 1.577278
N  -1.470477 -1.873029 0.425873
N  -2.230148 -0.057852 -0.813022
N  -3.619776 -1.201446 0.714512
C  2.689616 -0.553778 -0.007504
C  2.668069 0.608511 0.749292
C  3.65193 0.390127 1.722307
C  4.041635 -2.695592 0.159319
C  1.771047 1.760205 0.635177
C  -0.148128 -1.952111 0.024309
C  1.414817 3.96348 1.393972
C  -2.477041 -0.997976 0.082441
C  2.111728 4.966483 2.281978
C  -3.229437 0.769113 -1.104691
C  -4.60716 -0.371532 0.412065
C  -4.477111 0.65958 -0.510228
C  -1.753197 1.859821 -2.59192
C  -5.922048 -1.561628 1.961734
H  3.95655 1.045918 2.521557
H  -0.438529 -0.305494 -1.183346
H  4.518404 -2.702132 -0.816637
H  3.186996 -3.364076 0.149352
H  4.752597 -3.010205 0.915402
H  0.415882 3.731466 1.771207
H  1.298278 4.351622 0.379477
H  3.102774 5.214983 1.903635
H  1.528302 5.886093 2.31949
H  2.215737 4.595734 3.301421
H  -5.289222 1.329578 -0.746702
H  -1.84064 2.698897 -3.276623
H  -0.979378 2.07192 -1.854927
H  -1.475825 0.968494 -3.156671
H  -5.758298 -2.543193 1.515826
H  -5.236416 -1.443076 2.801484
H  -6.946408 -1.491654 2.317892
H  -1.724138 -2.54955 1.130056
totalener: -1797.78224491 hartree
nucrepener: 3060.70205791 hartree
electener: -4858.48430281 hartree
oneelecener: -8549.94046658 hartree
twoeener: 3691.45616377 hartree
kineticenergy: 1791.42156752 hartree
xcener: -147.481166650322 hartree
chargesum: -0.0000000
charge: 0.852714 -0.437217 -0.437044 -0.268461 -0.416382 -0.396363 -0.262713 -0.264315 0.183277 -0.206432 -0.280616 -0.164377 -0.416489 -0.409033 -0.117098 -0.091567 -0.054273 -0.173397 0.477071 0.352677 0.027642 0.360289 -0.235212 0.401140 0.385101 -0.304704 -0.139339 -0.125067 0.139577 0.221210 0.122467 0.139164 0.113896 0.087311 0.088769 0.087861 0.081276 0.084447 0.128459 0.125568 0.127753 0.106130 0.107935 0.107301 0.123755 0.167309
qa: 0.8527 -0.4372 -0.4370 -0.2685 -0.4164 -0.3964 -0.2627 -0.2643 0.1833 -0.2064 -0.2806 -0.1644 -0.4165 -0.4090 -0.1171 -0.0916 -0.0543 -0.1734 0.4771 0.3527 0.0276 0.3603 -0.2352 0.4011 0.3851 -0.3047 -0.1393 -0.1251 0.1396 0.2212 0.1225 0.1392 0.1139 0.0873 0.0888 0.0879 0.0813 0.0844 0.1285 0.1256 0.1278 0.1061 0.1079 0.1073 0.1238 0.1673
va: 5.9156 2.0668 2.0661 2.1420 2.0769 2.1171 2.1617 2.1485 3.3503 3.0974 2.8971 3.1654 2.9717 2.9721 4.0652 3.7212 4.0947 3.8615 4.1069 4.3899 3.8745 4.2463 3.9616 4.0242 4.0562 3.9387 3.8569 3.8774 1.0137 1.0461 0.9946 0.9981 1.0089 0.9993 0.9979 1.0047 1.0085 1.0044 1.0222 0.9950 0.9999 0.9964 0.9969 0.9970 0.9941 1.0365
dispcorr: -0.024958935 hartree
energy: -1797.807203840537
dipole: -4.16461 2.87386 -1.29074 13.77449 -12.81274 0.96175 9.71788 -8.54017 1.17771
magnitude: 1.99449 au
magnitude: 5.06959 debye
