program: Orca
programVersion: 4.2.1
elementType: S O O O O O O O N N N N N N C C C C C C C C C C C C C C H H H H H H H H H H H H H H H H H H
charge: 0
multiplicity: 1
keywords: wb97x-d3
keywords: def2-TZVPP
keywords: def2/J RIJCOSX GRIDX6 NOFINALGRIDX
keywords: grid4 nofinalgrid
keywords: scfconv7
keywords: smallprint printgap noloewdin
keywords: NOSOSCF
formula: C14H18N6O7S
InChI: InChI=1S/C14H18N6O7S/c1-5-27-12(21)8-7-15-20(2)11(8)28(23,24)19-14(22)18-13-16-9(25-3)6-10(17-13)26-4/h6-7,18-19H,5H2,1-4H3
46 atoms
S  1.791626 -0.917161 -1.493286
O  2.260501 -2.185352 -1.988676
O  1.796547 0.254553 -2.331137
O  2.132923 2.746643 1.419876
O  0.723359 1.770024 -0.014959
O  0.601831 -2.763206 0.493845
O  -3.027272 1.728674 -2.011441
O  -5.750697 -0.468933 1.038317
N  3.619673 -1.349144 0.532519
N  0.222156 -1.0611 -0.969116
N  4.184144 -0.790506 1.592748
N  -1.467924 -1.872313 0.404058
N  -2.224946 -0.056473 -0.835131
N  -3.606301 -1.176763 0.716743
C  2.677575 -0.554006 -0.006776
C  2.633334 0.599333 0.762897
C  3.607289 0.380566 1.745895
C  4.052403 -2.68245 0.153142
C  1.725062 1.742268 0.651299
C  -0.146543 -1.956091 -0.000338
C  1.31829 3.92121 1.452917
C  -2.46966 -0.98873 0.068952
C  1.971385 4.907454 2.391013
C  -3.218719 0.779973 -1.117961
C  -4.588561 -0.337865 0.422687
C  -4.459535 0.6872 -0.506465
C  -1.750371 1.845027 -2.631018
C  -5.894793 -1.502297 1.99907
H  3.895034 1.030708 2.555915
H  -0.436942 -0.313782 -1.213641
H  4.533083 -2.674598 -0.820805
H  3.206905 -3.362467 0.134507
H  4.764479 -2.99261 0.909974
H  0.311143 3.665224 1.790576
H  1.228858 4.336438 0.446507
H  1.373782 5.817629 2.435128
H  2.047193 4.50913 3.402425
H  2.970549 5.180306 2.053039
H  -5.267436 1.364797 -0.735524
H  -0.964693 2.051954 -1.90532
H  -1.491384 0.947527 -3.194547
H  -1.836905 2.681531 -3.318932
H  -6.913302 -1.41837 2.368816
H  -5.747957 -2.488994 1.558819
H  -5.196398 -1.384652 2.828307
H  -1.720762 -2.544472 1.112684
totalener: -1797.78217701 hartree
nucrepener: 3064.45430188 hartree
electener: -4862.23647889 hartree
oneelecener: -8557.44035492 hartree
twoeener: 3695.20387603 hartree
kineticenergy: 1791.42263194 hartree
xcener: -147.481343949044 hartree
chargesum: -0.0000000
charge: 0.853302 -0.437210 -0.436739 -0.268667 -0.416647 -0.395298 -0.262610 -0.264378 0.183804 -0.206823 -0.280760 -0.164569 -0.415640 -0.408904 -0.118344 -0.091558 -0.054237 -0.173399 0.478039 0.351208 0.027854 0.359726 -0.235195 0.401739 0.385316 -0.305335 -0.139830 -0.124930 0.139825 0.220911 0.122541 0.139065 0.114012 0.087043 0.088849 0.081452 0.084361 0.087643 0.128277 0.128109 0.106141 0.125730 0.123694 0.107945 0.107206 0.167285
qa: 0.8533 -0.4372 -0.4367 -0.2687 -0.4166 -0.3953 -0.2626 -0.2644 0.1838 -0.2068 -0.2808 -0.1646 -0.4156 -0.4089 -0.1183 -0.0916 -0.0542 -0.1734 0.4780 0.3512 0.0279 0.3597 -0.2352 0.4017 0.3853 -0.3053 -0.1398 -0.1249 0.1398 0.2209 0.1225 0.1391 0.1140 0.0870 0.0888 0.0815 0.0844 0.0876 0.1283 0.1281 0.1061 0.1257 0.1237 0.1079 0.1072 0.1673
va: 5.9143 2.0667 2.0662 2.1420 2.0761 2.1179 2.1618 2.1482 3.3499 3.0967 2.8972 3.1651 2.9713 2.9724 4.0676 3.7184 4.0949 3.8613 4.1062 4.3912 3.8743 4.2471 3.9613 4.0231 4.0559 3.9388 3.8565 3.8775 1.0136 1.0471 0.9947 0.9979 1.0090 0.9994 0.9980 1.0085 1.0044 1.0047 1.0223 0.9995 0.9961 0.9950 0.9941 0.9969 0.9970 1.0365
dispcorr: -0.025027901 hartree
energy: -1797.807204908762
dipole: -4.47708 3.17262 -1.30446 13.67528 -12.71848 0.95681 10.04467 -8.84774 1.19693
magnitude: 2.01240 au
magnitude: 5.11511 debye
