program: Orca
programVersion: 4.2.1
elementType: S O O O O O O O N N N N N N C C C C C C C C C C C C C C H H H H H H H H H H H H H H H H H H
charge: 0
multiplicity: 1
keywords: wb97x-d3
keywords: def2-TZVPP
keywords: def2/J RIJCOSX GRIDX6 NOFINALGRIDX
keywords: grid4 nofinalgrid
keywords: scfconv7
keywords: smallprint printgap noloewdin
keywords: NOSOSCF
formula: C14H18N6O7S
InChI: InChI=1S/C14H18N6O7S/c1-5-27-12(21)8-7-15-20(2)11(8)28(23,24)19-14(22)18-13-16-9(25-3)6-10(17-13)26-4/h6-7,18-19H,5H2,1-4H3
46 atoms
S  1.808007 -0.926833 -1.495739
O  2.281762 -2.195639 -1.984825
O  1.813634 0.241514 -2.338029
O  2.110714 2.735483 1.428685
O  0.723448 1.758743 -0.02752
O  0.617012 -2.764428 0.497561
O  -3.007256 1.720034 -2.02877
O  -5.720794 -0.43539 1.05927
N  3.631293 -1.346878 0.537166
N  0.237346 -1.072428 -0.976872
N  4.187168 -0.786019 1.600884
N  -1.451193 -1.870061 0.406167
N  -2.20664 -0.061011 -0.844268
N  -3.583114 -1.158982 0.727961
C  2.687125 -0.556846 -0.006177
C  2.632345 0.595496 0.76454
C  3.60384 0.382141 1.751213
C  4.070448 -2.678345 0.160707
C  1.717268 1.732574 0.650576
C  -0.131164 -1.959585 -0.000716
C  1.287938 3.904422 1.460253
C  -2.450282 -0.983482 0.070117
C  1.920104 4.885985 2.417917
C  -3.197307 0.779448 -1.126441
C  -4.562444 -0.316444 0.434124
C  -4.434038 0.699691 -0.504852
C  -1.734891 1.824123 -2.659813
C  -5.863813 -1.460438 2.029185
H  3.883789 1.033335 2.563147
H  -0.421882 -0.326273 -1.224914
H  4.782367 -2.985038 0.919263
H  4.553074 -2.670367 -0.812351
H  3.227837 -3.362015 0.141382
H  0.277513 3.638817 1.78026
H  1.21095 4.32877 0.456509
H  2.92228 5.169131 2.097683
H  1.315406 5.79145 2.462176
H  1.983663 4.477836 3.426348
H  -5.239284 1.380582 -0.733715
H  -0.941847 2.031677 -1.942235
H  -1.486036 0.920764 -3.218809
H  -1.822324 2.6560 -3.35322
H  -6.87886 -1.367197 2.406239
H  -5.726477 -2.45153 1.595429
H  -5.157994 -1.340851 2.852028
H  -1.703215 -2.53509 1.121816
totalener: -1797.78216569 hartree
nucrepener: 3066.46511326 hartree
electener: -4864.24727895 hartree
oneelecener: -8561.45894129 hartree
twoeener: 3697.21166234 hartree
kineticenergy: 1791.42064427 hartree
xcener: -147.480972213550 hartree
chargesum: 0.0000000
charge: 0.853655 -0.437226 -0.436562 -0.268713 -0.416826 -0.394929 -0.262511 -0.264369 0.183729 -0.206823 -0.280687 -0.164577 -0.414880 -0.408891 -0.118963 -0.091426 -0.054352 -0.173291 0.478410 0.350547 0.027723 0.359329 -0.235287 0.402079 0.385357 -0.305576 -0.139938 -0.124851 0.139824 0.220555 0.113943 0.122575 0.138931 0.086930 0.089017 0.087561 0.081577 0.084384 0.128249 0.128126 0.106232 0.125783 0.123669 0.107980 0.107175 0.167335
qa: 0.8537 -0.4372 -0.4366 -0.2687 -0.4168 -0.3949 -0.2625 -0.2644 0.1837 -0.2068 -0.2807 -0.1646 -0.4149 -0.4089 -0.1190 -0.0914 -0.0544 -0.1733 0.4784 0.3505 0.0277 0.3593 -0.2353 0.4021 0.3854 -0.3056 -0.1399 -0.1249 0.1398 0.2206 0.1139 0.1226 0.1389 0.0869 0.0890 0.0876 0.0816 0.0844 0.1282 0.1281 0.1062 0.1258 0.1237 0.1080 0.1072 0.1673
va: 5.9145 2.0667 2.0664 2.1419 2.0757 2.1181 2.1620 2.1482 3.3499 3.0962 2.8974 3.1651 2.9714 2.9723 4.0684 3.7160 4.0953 3.8614 4.1063 4.3917 3.8743 4.2475 3.9612 4.0225 4.0562 3.9390 3.8564 3.8774 1.0136 1.0478 1.0090 0.9947 0.9979 0.9995 0.9980 1.0047 1.0084 1.0045 1.0223 0.9993 0.9959 0.9950 0.9941 0.9969 0.9970 1.0364
dispcorr: -0.025067358 hartree
energy: -1797.807233049430
dipole: -4.62342 3.30736 -1.31607 13.67899 -12.71589 0.96310 10.13091 -8.92871 1.20219
magnitude: 2.02605 au
magnitude: 5.14980 debye
