program: Orca
programVersion: 4.2.1
elementType: S O O O O O O O N N N N N N C C C C C C C C C C C C C C H H H H H H H H H H H H H H H H H H
charge: 0
multiplicity: 1
keywords: wb97x-d3
keywords: def2-TZVPP
keywords: def2/J RIJCOSX GRIDX6 NOFINALGRIDX
keywords: grid4 nofinalgrid
keywords: scfconv7
keywords: smallprint printgap noloewdin
keywords: NOSOSCF
formula: C14H18N6O7S
InChI: InChI=1S/C14H18N6O7S/c1-5-27-12(21)8-7-15-20(2)11(8)28(23,24)19-14(22)18-13-16-9(25-3)6-10(17-13)26-4/h6-7,18-19H,5H2,1-4H3
46 atoms
S  1.79055 -0.759737 -1.383205
O  2.294557 -1.97132 -1.976344
O  1.768934 0.474929 -2.125081
O  2.036232 2.664726 1.815842
O  0.654714 1.766347 0.298722
O  0.637347 -2.776593 0.458235
O  -3.084131 1.778108 -1.777954
O  -5.796937 -0.723662 1.038167
N  3.62162 -1.310919 0.609526
N  0.223956 -0.985126 -0.883761
N  4.172106 -0.82565 1.712416
N  -1.455223 -1.935648 0.40943
N  -2.247805 -0.060716 -0.714078
N  -3.622848 -1.334725 0.719745
C  2.662794 -0.496373 0.132295
C  2.591582 0.590743 0.991284
C  3.570508 0.317435 1.955414
C  4.082268 -2.601788 0.129762
C  1.654804 1.715704 0.966697
C  -0.128498 -1.956362 0.015043
C  1.2078 3.823734 1.940603
C  -2.479794 -1.063536 0.114915
C  1.470952 4.835035 0.845515
C  -3.262729 0.761759 -0.959207
C  -4.626545 -0.508504 0.463892
C  -4.512004 0.585896 -0.38454
C  -1.802403 1.971853 -2.366721
C  -5.930857 -1.838698 1.904565
H  3.843327 0.906722 2.815555
H  -0.453849 -0.240045 -1.080167
H  4.577335 -2.507352 -0.8324
H  3.2489 -3.291108 0.042627
H  4.787984 -2.961775 0.870204
H  1.462807 4.238252 2.915219
H  0.155452 3.535314 1.960442
H  2.520438 5.126689 0.819787
H  1.192494 4.45103 -0.134173
H  0.880045 5.732295 1.032526
H  -5.337009 1.252065 -0.584026
H  -1.032757 2.148884 -1.616122
H  -1.509971 1.123204 -2.986665
H  -1.90253 2.851366 -2.996704
H  -5.254761 -1.772751 2.757455
H  -6.959354 -1.815463 2.254596
H  -5.744512 -2.779319 1.385542
H  -1.698233 -2.663537 1.064387
totalener: -1797.78165591 hartree
nucrepener: 3077.51373074 hartree
electener: -4875.29538664 hartree
oneelecener: -8583.56810737 hartree
twoeener: 3708.27272072 hartree
kineticenergy: 1791.42841593 hartree
xcener: -147.483559506126 hartree
chargesum: -0.0000000
charge: 0.854089 -0.438120 -0.438129 -0.272332 -0.421950 -0.394982 -0.262869 -0.263995 0.183953 -0.205290 -0.280715 -0.163677 -0.415564 -0.408325 -0.123535 -0.099272 -0.055059 -0.172361 0.491167 0.350446 0.029086 0.359217 -0.251838 0.401907 0.384325 -0.304166 -0.136416 -0.125359 0.140277 0.220118 0.122787 0.137866 0.113716 0.099606 0.084834 0.088074 0.097671 0.082545 0.128545 0.123153 0.107837 0.126011 0.107544 0.123829 0.108047 0.167302
qa: 0.8541 -0.4381 -0.4381 -0.2723 -0.4219 -0.3950 -0.2629 -0.2640 0.1840 -0.2053 -0.2807 -0.1637 -0.4156 -0.4083 -0.1235 -0.0993 -0.0551 -0.1724 0.4912 0.3504 0.0291 0.3592 -0.2518 0.4019 0.3843 -0.3042 -0.1364 -0.1254 0.1403 0.2201 0.1228 0.1379 0.1137 0.0996 0.0848 0.0881 0.0977 0.0825 0.1285 0.1232 0.1078 0.1260 0.1075 0.1238 0.1080 0.1673
va: 5.9140 2.0659 2.0647 2.1445 2.0657 2.1186 2.1618 2.1489 3.3504 3.0974 2.8973 3.1652 2.9718 2.9729 4.0732 3.7021 4.0998 3.8624 4.1136 4.3922 3.8671 4.2475 3.9186 4.0214 4.0571 3.9386 3.8611 3.8772 1.0138 1.0479 0.9944 0.9986 1.0091 0.9951 1.0135 1.0058 1.0113 1.0092 1.0222 0.9971 0.9963 0.9950 0.9969 0.9940 0.9969 1.0364
dispcorr: -0.025471260 hartree
energy: -1797.807127165320
dipole: -5.61319 4.22927 -1.38392 12.85038 -12.04127 0.80911 6.32198 -5.19441 1.12757
magnitude: 1.95992 au
magnitude: 4.98173 debye
