program: Orca
programVersion: 4.2.1
elementType: S O O O O O O O N N N N N N C C C C C C C C C C C C C C H H H H H H H H H H H H H H H H H H
charge: 0
multiplicity: 1
keywords: wb97x-d3
keywords: def2-TZVPP
keywords: def2/J RIJCOSX GRIDX6 NOFINALGRIDX
keywords: grid4 nofinalgrid
keywords: scfconv7
keywords: smallprint printgap noloewdin
keywords: NOSOSCF
formula: C14H18N6O7S
InChI: InChI=1S/C14H18N6O7S/c1-5-27-12(21)8-7-15-20(2)11(8)28(23,24)19-14(22)18-13-16-9(25-3)6-10(17-13)26-4/h6-7,18-19H,5H2,1-4H3
46 atoms
S  1.736607 -1.092211 1.260986
O  1.674369 -0.070201 2.274406
O  2.222938 -2.412186 1.569088
O  2.079394 2.989308 -1.033263
O  0.646543 1.75944 0.171467
O  0.681871 -2.598981 -1.062567
O  -3.161016 1.311116 2.025261
O  -5.707531 -0.374029 -1.470949
N  3.658417 -1.155895 -0.721484
N  0.194664 -1.185426 0.653882
N  4.249645 -0.424717 -1.654632
N  -1.41222 -1.773156 -0.917105
N  -2.266463 -0.22097 0.588163
N  -3.556809 -1.079555 -1.191493
C  2.671025 -0.477342 -0.109056
C  2.623972 0.781018 -0.691268
C  3.645501 0.742586 -1.649167
C  4.11104 -2.523597 -0.539596
C  1.674588 1.867973 -0.445168
C  -0.10795 -1.903946 -0.472107
C  1.24179 4.143297 -0.923879
C  -2.450839 -0.984261 -0.474782
C  1.437998 4.86998 0.389134
C  -3.292759 0.531452 0.971634
C  -4.572521 -0.326376 -0.796107
C  -4.506706 0.522243 0.302205
C  -1.912892 1.340006 2.709741
C  -5.790134 -1.2343 -2.595617
H  3.947752 1.517825 -2.334038
H  -0.495814 -0.505193 0.991442
H  3.283605 -3.213993 -0.665582
H  4.552674 -2.661871 0.442844
H  4.859851 -2.695222 -1.304866
H  0.19572 3.865595 -1.06365
H  1.537832 4.775327 -1.760106
H  2.481773 5.144514 0.537061
H  0.849222 5.787725 0.385897
H  1.112869 4.268793 1.23603
H  -5.341136 1.131335 0.613552
H  -1.64587 0.359634 3.10651
H  -1.107428 1.698396 2.069599
H  -2.051908 2.030188 3.537245
H  -5.065829 -0.965962 -3.365143
H  -5.633533 -2.277411 -2.320099
H  -6.796533 -1.109702 -2.986078
H  -1.618165 -2.315591 -1.742466
totalener: -1797.78146233 hartree
nucrepener: 3080.20613289 hartree
electener: -4877.98759522 hartree
oneelecener: -8588.94959775 hartree
twoeener: 3710.96200253 hartree
kineticenergy: 1791.43166949 hartree
xcener: -147.484074264662 hartree
chargesum: -0.0000000
charge: 0.854334 -0.438279 -0.437981 -0.272593 -0.421655 -0.394642 -0.263007 -0.264226 0.183220 -0.205234 -0.281341 -0.163750 -0.414304 -0.408899 -0.122388 -0.100447 -0.054996 -0.171658 0.491278 0.349882 0.030006 0.358494 -0.252821 0.402378 0.386032 -0.305896 -0.135578 -0.125161 0.140265 0.220180 0.137795 0.122283 0.114292 0.084821 0.098840 0.088221 0.083429 0.097504 0.128387 0.106967 0.123415 0.126122 0.107331 0.108407 0.123765 0.167209
qa: 0.8543 -0.4383 -0.4380 -0.2726 -0.4217 -0.3946 -0.2630 -0.2642 0.1832 -0.2052 -0.2813 -0.1637 -0.4143 -0.4089 -0.1224 -0.1004 -0.0550 -0.1717 0.4913 0.3499 0.0300 0.3585 -0.2528 0.4024 0.3860 -0.3059 -0.1356 -0.1252 0.1403 0.2202 0.1378 0.1223 0.1143 0.0848 0.0988 0.0882 0.0834 0.0975 0.1284 0.1070 0.1234 0.1261 0.1073 0.1084 0.1238 0.1672
va: 5.9136 2.0642 2.0662 2.1441 2.0665 2.1185 2.1620 2.1485 3.3504 3.0974 2.8970 3.1655 2.9728 2.9725 4.0756 3.7007 4.0998 3.8616 4.1123 4.3918 3.8686 4.2490 3.9180 4.0210 4.0556 3.9389 3.8611 3.8770 1.0139 1.0481 0.9985 0.9949 1.0091 1.0134 0.9953 1.0058 1.0090 1.0113 1.0223 0.9963 0.9970 0.9948 0.9971 0.9969 0.9940 1.0364
dispcorr: -0.025535617 hartree
energy: -1797.806997947338
dipole: -5.46860 4.13435 -1.33425 14.08658 -13.01087 1.07571 -3.45102 2.47559 -0.97543
magnitude: 1.97202 au
magnitude: 5.01247 debye
