program: Orca
programVersion: 4.2.1
elementType: S O O O O O O O N N N N N N C C C C C C C C C C C C C C H H H H H H H H H H H H H H H H H H
charge: 0
multiplicity: 1
keywords: wb97x-d3
keywords: def2-TZVPP
keywords: def2/J RIJCOSX GRIDX6 NOFINALGRIDX
keywords: grid4 nofinalgrid
keywords: scfconv7
keywords: smallprint printgap noloewdin
keywords: NOSOSCF
formula: C14H18N6O7S
InChI: InChI=1S/C14H18N6O7S/c1-5-27-12(21)8-7-15-20(2)11(8)28(23,24)19-14(22)18-13-16-9(25-3)6-10(17-13)26-4/h6-7,18-19H,5H2,1-4H3
46 atoms
S  1.746131 -1.008023 1.347291
O  1.698892 0.089909 2.278668
O  2.224882 -2.303844 1.753668
O  2.105184 2.882728 -1.255164
O  0.67174 1.76564 0.054028
O  0.664064 -2.684975 -0.842842
O  -3.131362 1.487719 1.946797
O  -5.711805 -0.452426 -1.389317
N  3.646995 -1.241704 -0.642941
N  0.198416 -1.136091 0.75947
N  4.234303 -0.589639 -1.635152
N  -1.422569 -1.833307 -0.751346
N  -2.256271 -0.159559 0.630349
N  -3.564224 -1.148713 -1.066801
C  2.673101 -0.508604 -0.073291
C  2.631269 0.702478 -0.748765
C  3.641603 0.580967 -1.711677
C  4.088442 -2.596253 -0.362096
C  1.694584 1.814702 -0.578396
C  -0.116591 -1.93883 -0.304201
C  1.278497 4.049477 -1.231771
C  -2.452719 -1.004254 -0.36683
C  1.496238 4.880271 0.014714
C  -3.275455 0.627695 0.959416
C  -4.57223 -0.359338 -0.726652
C  -4.493828 0.573412 0.300375
C  -1.877064 1.564175 2.616529
C  -5.806847 -1.398843 -2.441546
H  3.942786 1.299315 -2.456476
H  -0.484437 -0.424907 1.04475
H  4.826244 -2.833857 -1.12043
H  3.252725 -3.285597 -0.425588
H  4.540455 -2.664229 0.623096
H  0.228586 3.77065 -1.336197
H  1.569278 4.608055 -2.120728
H  2.54448 5.155115 0.128765
H  0.916476 5.801094 -0.058511
H  1.175025 4.35463 0.912035
H  -5.322557 1.210757 0.567074
H  -1.616916 0.619939 3.0969
H  -1.073491 1.855139 1.940825
H  -2.001879 2.326593 3.380426
H  -5.0829 -1.200338 -3.232119
H  -5.65937 -2.4181 -2.083913
H  -6.813317 -1.296018 -2.837854
H  -1.637787 -2.437216 -1.53024
totalener: -1797.78153162 hartree
nucrepener: 3079.94254447 hartree
electener: -4877.72407609 hartree
oneelecener: -8588.41744008 hartree
twoeener: 3710.69336399 hartree
kineticenergy: 1791.42884193 hartree
xcener: -147.483549367984 hartree
chargesum: -0.0000000
charge: 0.854013 -0.437773 -0.437494 -0.272545 -0.422170 -0.395632 -0.263024 -0.264345 0.183996 -0.205354 -0.281263 -0.163888 -0.414625 -0.408633 -0.122957 -0.099771 -0.055247 -0.172988 0.492357 0.350562 0.029629 0.358698 -0.252894 0.402131 0.385729 -0.305524 -0.134892 -0.124930 0.139881 0.219650 0.114172 0.138357 0.122823 0.084826 0.098940 0.088119 0.083208 0.097978 0.128422 0.107176 0.122678 0.126040 0.107480 0.108294 0.123534 0.167254
qa: 0.8540 -0.4378 -0.4375 -0.2725 -0.4222 -0.3956 -0.2630 -0.2643 0.1840 -0.2054 -0.2813 -0.1639 -0.4146 -0.4086 -0.1230 -0.0998 -0.0552 -0.1730 0.4924 0.3506 0.0296 0.3587 -0.2529 0.4021 0.3857 -0.3055 -0.1349 -0.1249 0.1399 0.2196 0.1142 0.1384 0.1228 0.0848 0.0989 0.0881 0.0832 0.0980 0.1284 0.1072 0.1227 0.1260 0.1075 0.1083 0.1235 0.1673
va: 5.9140 2.0650 2.0665 2.1440 2.0668 2.1175 2.1620 2.1485 3.3491 3.0972 2.8970 3.1656 2.9719 2.9727 4.0746 3.7004 4.0999 3.8611 4.1118 4.3909 3.8682 4.2488 3.9181 4.0212 4.0561 3.9392 3.8610 3.8771 1.0141 1.0486 1.0090 0.9983 0.9946 1.0134 0.9952 1.0058 1.0091 1.0112 1.0223 0.9963 0.9973 0.9949 0.9970 0.9969 0.9942 1.0364
dispcorr: -0.025529654 hartree
energy: -1797.807061274307
dipole: -5.37223 4.04406 -1.32816 13.83642 -12.82909 1.00733 -4.55079 3.49528 -1.05551
magnitude: 1.97303 au
magnitude: 5.01503 debye
