program: Orca
programVersion: 4.2.1
elementType: S O O O O O O O N N N N N N C C C C C C C C C C C C C C H H H H H H H H H H H H H H H H H H
charge: 0
multiplicity: 1
keywords: wb97x-d3
keywords: def2-TZVPP
keywords: def2/J RIJCOSX GRIDX6 NOFINALGRIDX
keywords: grid4 nofinalgrid
keywords: scfconv7
keywords: smallprint printgap noloewdin
keywords: NOSOSCF
formula: C14H18N6O7S
InChI: InChI=1S/C14H18N6O7S/c1-5-27-12(21)8-7-15-20(2)11(8)28(23,24)19-14(22)18-13-16-9(25-3)6-10(17-13)26-4/h6-7,18-19H,5H2,1-4H3
46 atoms
S  1.81533 -0.811794 -1.424624
O  2.316723 -2.033306 -1.999221
O  1.812145 0.415653 -2.178745
O  2.009916 2.616267 1.782003
O  0.664609 1.727824 0.227272
O  0.629662 -2.79958 0.423995
O  -3.029314 1.791495 -1.848601
O  -5.734727 -0.57293 1.090422
N  3.628252 -1.349173 0.588818
N  0.241316 -1.019423 -0.940239
N  4.166184 -0.858423 1.69576
N  -1.4489 -1.924831 0.371624
N  -2.216795 -0.050464 -0.770721
N  -3.588738 -1.254333 0.725899
C  2.67182 -0.539448 0.098929
C  2.588539 0.550493 0.953556
C  3.557568 0.282747 1.929386
C  4.096044 -2.641442 0.119882
C  1.65001 1.673474 0.9165
C  -0.124435 -1.973282 -0.027823
C  1.174112 3.770592 1.900771
C  -2.454957 -1.028641 0.08548
C  1.453586 4.793251 0.820265
C  -3.214399 0.79585 -1.00602
C  -4.575293 -0.405322 0.478799
C  -4.452966 0.666895 -0.396498
C  -1.756964 1.94285 -2.469131
C  -5.870343 -1.653549 1.999157
H  3.819829 0.876283 2.789894
H  -0.426263 -0.268263 -1.147311
H  4.587628 -2.553216 -0.84453
H  3.266802 -3.336995 0.041624
H  4.806245 -2.989733 0.861644
H  1.408306 4.177277 2.88399
H  0.122769 3.477493 1.897715
H  0.85895 5.68802 1.007165
H  2.503066 5.086092 0.814431
H  1.191274 4.419215 -0.167711
H  -5.263728 1.35275 -0.587681
H  -0.966539 2.112884 -1.738826
H  -1.500262 1.076894 -3.080851
H  -1.849488 2.814294 -3.111443
H  -5.170696 -1.572464 2.831624
H  -6.888434 -1.594377 2.374798
H  -5.718432 -2.616289 1.510519
H  -1.698779 -2.635498 1.04276
totalener: -1797.78156071 hartree
nucrepener: 3081.51028658 hartree
electener: -4879.29184729 hartree
oneelecener: -8591.55322313 hartree
twoeener: 3712.26137584 hartree
kineticenergy: 1791.42414028 hartree
xcener: -147.482619992522 hartree
chargesum: 0.0000000
charge: 0.854637 -0.437772 -0.437889 -0.272445 -0.422517 -0.393387 -0.262672 -0.264244 0.183604 -0.205381 -0.280798 -0.164353 -0.414733 -0.408254 -0.123526 -0.099823 -0.054845 -0.172086 0.492153 0.348713 0.028956 0.358992 -0.251791 0.402555 0.384744 -0.305003 -0.137029 -0.124986 0.140282 0.219662 0.122633 0.137812 0.113796 0.099647 0.084659 0.082734 0.087858 0.097765 0.128299 0.123422 0.107963 0.126314 0.107437 0.123714 0.107829 0.167355
qa: 0.8546 -0.4378 -0.4379 -0.2724 -0.4225 -0.3934 -0.2627 -0.2642 0.1836 -0.2054 -0.2808 -0.1644 -0.4147 -0.4083 -0.1235 -0.0998 -0.0548 -0.1721 0.4922 0.3487 0.0290 0.3590 -0.2518 0.4026 0.3847 -0.3050 -0.1370 -0.1250 0.1403 0.2197 0.1226 0.1378 0.1138 0.0996 0.0847 0.0827 0.0879 0.0978 0.1283 0.1234 0.1080 0.1263 0.1074 0.1237 0.1078 0.1674
va: 5.9134 2.0662 2.0648 2.1443 2.0648 2.1198 2.1616 2.1486 3.3505 3.0970 2.8975 3.1651 2.9709 2.9727 4.0745 3.7003 4.1000 3.8623 4.1131 4.3943 3.8680 4.2478 3.9182 4.0204 4.0565 3.9391 3.8609 3.8774 1.0139 1.0487 0.9947 0.9982 1.0091 0.9951 1.0133 1.0092 1.0059 1.0112 1.0223 0.9964 0.9959 0.9949 0.9970 0.9941 0.9969 1.0364
dispcorr: -0.025539231 hartree
energy: -1797.807099940880
dipole: -5.64452 4.26828 -1.37624 13.07885 -12.22613 0.85272 6.52394 -5.37577 1.14816
magnitude: 1.98480 au
magnitude: 5.04497 debye
