program: Gaussian 09
title: 000069130
version: EM64L-G09RevD.01
frameworkgroup: C1[X(C9H11NO2)]
method: RPBEPBE
basis: SDD
operation: Freq
keyword: #p
keyword: freq=noraman
keyword: PBEPBE/SDD
title: #p freq=noraman PBEPBE/SDD
converged: YES YES NO YES
title: Mulliken charges:
elementType: O O N C C C C C C C C C H H H H H H H H H H H
charge: -0.218484 -0.210644 0.017811 0.350461 0.384735 0.396027 0.214626 -0.604942 -0.590100 -0.809516 -0.807353 -0.776974 0.243225 0.290102 0.233048 0.236885 0.233104 0.241672 0.229162 0.229131 0.253015 0.253009 0.212002
chargesum: 0.00000
title: Mulliken charges with hydrogens summed into heavy atoms:
elementType: O O N C C C C C C C C C
charge: -0.218484 -0.210644 0.017811 0.350461 0.384735 0.396027 0.214626 -0.361717 -0.299998 -0.106480 -0.107388 -0.058948
polarizability: 1.64239463e+02 -1.44395436e+00 1.30364065e+02 9.64577231e-03 7.38215399e-03 5.81675497e+01
1716.lowfreq: -0.0007 -0.0007 0.0003 5.3595 17.2260 17.2543 26.0589 86.9040 117.2796
frequency: 25.8678 86.8796 117.2660 138.3888 178.1330 216.9687 229.3474 249.0044 289.8160 319.1879 340.6011 353.7485 402.1183 446.3708 469.8428 564.0966 568.2493 598.9218 689.8070 713.0029 726.8892 745.2138 802.1201 886.1421 925.5900 989.6182 997.0159 1020.6644 1032.4692 1035.0936 1042.1404 1054.4738 1158.5247 1196.8948 1204.9386 1265.1875 1276.3310 1340.6392 1371.3330 1395.6329 1398.9188 1407.8431 1410.5562 1454.7346 1461.9232 1463.0783 1473.7698 1475.9110 1479.9299 1496.7608 1567.6317 1626.3228 2973.7972 2975.3136 2995.1420 3045.4636 3049.2575 3081.1695 3091.2358 3093.4949 3095.0493 3126.8751 3170.5079
redmass: 8.9702 3.5798 1.0390 2.0635 1.2791 5.6003 1.2915 2.0122 2.5448 3.3536 3.7558 5.5781 5.4545 2.8915 5.0571 3.4170 4.0827 5.1434 4.2842 6.0054 4.3266 7.6723 4.0807 1.2770 1.3479 1.6066 1.6649 2.9435 1.4660 1.4472 1.5588 1.6585 3.1557 2.1106 9.1983 5.0478 1.2604 6.6703 4.3992 1.2398 2.4248 1.2759 1.6147 1.0458 1.0464 1.1292 1.2266 1.0450 1.1760 2.7255 6.5784 6.8332 1.0379 1.0387 1.0363 1.0967 1.0966 1.0960 1.0987 1.0980 1.1012 1.0913 1.0914
irintensity: 0.0005 0.9101 0.2099 2.0919 0.1839 1.8469 1.7604 0.7632 0.1504 1.8881 2.2769 0.2636 0.0126 5.6311 0.1904 1.5246 4.0755 2.1272 3.0587 7.7451 2.4783 10.5003 7.7562 7.1124 10.3356 2.4306 6.1959 15.1772 9.7225 4.2181 19.7899 0.4397 4.6542 76.9472 257.6045 16.7409 2.2800 78.6561 82.5131 5.0654 7.0313 14.4178 16.9247 11.3888 0.4521 2.4943 27.1762 34.8860 7.4619 50.4394 30.1004 21.3745 43.5350 6.7287 14.9721 35.1815 0.0133 7.8034 29.4168 2.1629 26.0644 18.8328 2.7237
temp: 298.150 k
press: 1.00000 atm
elementType: 8 8 7 6 6 6 6 6 6 6 6 6 1 1 1 1 1 1 1 1 1 1 1
symmnumber: 1
zpe: 477783.8 jmol-1
zpe.correction: 0.181978 hartree
zpe.thermalcorrener: 0.193870 hartree
zpe.thermalcorrenthalpy: 0.194814 hartree
zpe.thermalcorrgfe: 0.143700 hartree
zpe.sumelectzpe: -553.797917 hartree
zpe.sumelectthermal: -553.786026 hartree
zpe.sumelectthermalent: -553.785081 hartree
zpe.sumelectthermalfe: -553.836195 hartree
dipole: 5.7664 2.0020 0.0010
dipole: 6.1040
quadrupole: -76.8210 -67.8702 -71.6572
quadrupole: -6.2661 -0.0009 -0.0006
quadrupole: -4.7049 4.2460 0.4589 -6.2661 -0.0009 -0.0006
hfenergy: -553.9798957 hartree
pointgroup: C01 [X(C9H11N1O2)]
dipole: -2.2890082 0.7264093 -0.000407 debye
dipolederiv: -0.6004657 0.1849733 -0.0000495 0.2646084 -0.866882 0.0000628 -0.0000881 0.0001736 -0.2403045 -0.8771367 -0.1567918 0.0000019 -0.1950148 -0.5489757 0.0000664 -0.0000886 -0.0000123 -0.219968 1.7635864 -0.2417871 0.0001302 -0.2711358 1.2220176 -0.0001667 0.0001605 -0.0001638 0.1815696 0.5261614 -0.116224 0.0001134 -0.1978219 0.1300135 -0.0000402 0.0003225 -0.000078 -0.0057289 -0.0540005 0.4043513 -0.0000361 0.4773902 0.000361 0.000043 -0.0001148 -0.0000333 -0.055334 0.319144 0.265646 0.0000086 -0.1770942 0.2377667 -0.00003 0.000048 -0.0000058 0.0210062 -0.740029 0.2503888 -0.0001119 0.2091966 -0.1079752 0.000046 -0.0000347 0.0000247 0.0239705 -0.4459826 -0.1927667 -0.0000184 -0.1663656 0.0376392 -0.0000447 -0.0000327 -0.0000129 -0.1822252 0.1670587 -0.2749722 0.0000498 0.1391623 -0.1446763 0.0000072 0.0000229 -0.0000273 -0.1206005 -0.2651126 0.0630932 -0.0000796 -0.0484791 0.0893482 0.0000325 -0.000476 0.0001442 0.0480745 -0.0812775 -0.1354303 -0.0000021 -0.0786619 -0.009861 0.0000162 0.0000383 0.0001035 0.0616222 -0.0576099 -0.2797864 0.0000102 -0.1084505 0.0104528 -0.0000016 0.0000094 -0.000028 0.0263256 0.055915 0.0424453 0.0000016 0.0561627 -0.100513 0.0000177 0.0000027 0.0000008 0.1409488 0.131498 0.0265087 -0.0000056 -0.0063946 0.0190816 0.000003 0.0000055 0.0000029 0.1597469 -0.0095179 -0.0060062 0.0602538 -0.0147381 0.0647577 0.0945914 0.1119747 0.0588772 -0.0323565 0.0793445 -0.0325019 -0.0000263 0.085884 -0.1390701 -0.0002067 0.000118 -0.0001998 0.1117093 -0.0094659 -0.0058059 -0.0602605 -0.0144683 0.0650151 -0.0944019 -0.1118471 -0.0587464 -0.0327254 0.045361 0.1405925 0.0000426 0.0199827 -0.0859225 -0.0000627 0.000008 -0.0000669 0.1136318 -0.0190892 -0.0429989 0.1031469 -0.0149947 0.0638627 -0.0499003 0.1307944 0.0082146 -0.0399299 -0.019153 -0.0429401 -0.1031674 -0.014931 0.0638644 0.049961 -0.1308208 -0.0081913 -0.0398336 0.0316939 -0.0132784 -0.0849312 0.0065837 0.057583 0.0293263 -0.0861679 -0.0047704 -0.0111819 0.0316805 -0.0132771 0.0849357 0.0065782 0.0575785 -0.0293261 0.0861704 0.0047786 -0.0111846 0.0273971 0.1765678 -0.000006 0.0430017 -0.1154662 0.0000074 -0.0000047 0.0000161 0.1027677 unknown
polarizability: 164.1374062|2.3519797|130.4661218|0.0098407|-0.0071202|58.1675497 unknown
InChI: InChI=1S/C9H11NO2/c1-6-4-8(3)9(10(11)12)5-7(6)2/h4-5H,1-3H3
charge 0 multiplicity 1
23 atoms
O  2.447026 -1.931453 0.000303
O  3.183633 0.217905 0.000065
N  2.228447 -0.654824 -0.000032
C  -1.91728 0.499108 -0.0003
C  -1.539422 -0.881129 -0.00021
C  0.483505 1.199958 -0.000212
C  0.821762 -0.185568 -0.000122
C  -0.906029 1.487684 -0.000287
C  -0.169438 -1.197634 -0.000118
C  -3.377902 0.902187 -0.000517
C  -2.582743 -1.98173 -0.000214
C  1.466544 2.354073 -0.000222
H  -1.207822 2.541825 -0.000342
H  0.164065 -2.238886 -0.000047
H  -3.90665 0.501796 0.885674
H  -3.494867 1.998304 0.000433
H  -3.905848 0.503463 -0.887957
H  -2.111774 -2.978392 -0.000545
H  -3.240228 -1.918384 0.887975
H  -3.240665 -1.917981 -0.888044
H  2.134134 2.32154 0.877966
H  2.134161 2.321493 -0.878389
H  0.919991 3.312545 -0.000259
