program: Orca
programVersion: 4.2.1
elementType: S O O O O O O O N N N N N N C C C C C C C C C C C C C C H H H H H H H H H H H H H H H H H H
charge: 0
multiplicity: 1
keywords: wb97x-d3
keywords: def2-TZVPP
keywords: def2/J RIJCOSX GRIDX6 NOFINALGRIDX
keywords: grid4 nofinalgrid
keywords: scfconv7
keywords: smallprint printgap noloewdin
keywords: NOSOSCF
formula: C14H18N6O7S
InChI: InChI=1S/C14H18N6O7S/c1-5-27-12(21)8-7-15-20(2)11(8)28(23,24)19-14(22)18-13-16-9(25-3)6-10(17-13)26-4/h6-7,18-19H,5H2,1-4H3
46 atoms
S  1.761291 -0.96159 1.411519
O  1.727262 0.181333 2.287787
O  2.238392 -2.238612 1.875546
O  2.094352 2.785474 -1.401712
O  0.677904 1.744674 -0.013488
O  0.653529 -2.743459 -0.679067
O  -3.0985 1.606489 1.897079
O  -5.685418 -0.451471 -1.362698
N  3.648332 -1.297009 -0.577501
N  0.208235 -1.111413 0.844495
N  4.226491 -0.698133 -1.608277
N  -1.424494 -1.868554 -0.624705
N  -2.23965 -0.11698 0.66969
N  -3.552078 -1.165775 -0.98826
C  2.677867 -0.535878 -0.039899
C  2.627995 0.63716 -0.779259
C  3.630285 0.465333 -1.743096
C  4.097619 -2.632682 -0.2265
C  1.692875 1.75742 -0.660485
C  -0.11834 -1.96444 -0.176408
C  1.265452 3.950457 -1.437456
C  -2.443124 -1.005141 -0.287585
C  1.491592 4.852003 -0.242667
C  -3.248409 0.701292 0.95172
C  -4.549796 -0.344906 -0.695017
C  -4.463081 0.635013 0.286318
C  -1.850228 1.694385 2.576408
C  -5.785911 -1.444118 -2.371103
H  3.92387 1.142983 -2.528021
H  -0.466165 -0.379645 1.095012
H  4.831289 -2.907932 -0.976088
H  3.264958 -3.32818 -0.245884
H  4.557297 -2.644522 0.757522
H  0.215188 3.664119 -1.516392
H  1.547225 4.457591 -2.359617
H  2.53936 5.137688 -0.154986
H  0.906342 5.764268 -0.362683
H  1.181528 4.376903 0.686236
H  -5.28257 1.298506 0.515564
H  -1.96835 2.498477 3.297512
H  -1.614433 0.771882 3.108924
H  -1.033822 1.933833 1.895863
H  -6.787133 -1.344296 -2.781877
H  -5.05146 -1.293288 -3.162784
H  -5.657799 -2.448098 -1.965497
H  -1.646953 -2.50689 -1.373694
totalener: -1797.78154652 hartree
nucrepener: 3081.47093868 hartree
electener: -4879.25248519 hartree
oneelecener: -8591.47266821 hartree
twoeener: 3712.22018302 hartree
kineticenergy: 1791.42293063 hartree
xcener: -147.482342574293 hartree
chargesum: -0.0000000
charge: 0.854546 -0.437817 -0.437346 -0.272568 -0.422462 -0.393718 -0.262819 -0.264424 0.183974 -0.205956 -0.281026 -0.164440 -0.414472 -0.408526 -0.124173 -0.098643 -0.055392 -0.173013 0.491850 0.349581 0.029136 0.358543 -0.252423 0.402789 0.385574 -0.305766 -0.136075 -0.124692 0.140047 0.219620 0.114150 0.138333 0.122846 0.084928 0.099424 0.088030 0.082916 0.097980 0.128267 0.126220 0.107630 0.122968 0.123431 0.107425 0.108166 0.167376
qa: 0.8545 -0.4378 -0.4373 -0.2726 -0.4225 -0.3937 -0.2628 -0.2644 0.1840 -0.2060 -0.2810 -0.1644 -0.4145 -0.4085 -0.1242 -0.0986 -0.0554 -0.1730 0.4918 0.3496 0.0291 0.3585 -0.2524 0.4028 0.3856 -0.3058 -0.1361 -0.1247 0.1400 0.2196 0.1142 0.1383 0.1228 0.0849 0.0994 0.0880 0.0829 0.0980 0.1283 0.1262 0.1076 0.1230 0.1234 0.1074 0.1082 0.1674
va: 5.9136 2.0651 2.0665 2.1442 2.0658 2.1194 2.1618 2.1485 3.3490 3.0967 2.8971 3.1655 2.9708 2.9725 4.0748 3.6980 4.1001 3.8614 4.1130 4.3924 3.8680 4.2487 3.9181 4.0198 4.0561 3.9391 3.8611 3.8771 1.0140 1.0488 1.0090 0.9982 0.9945 1.0132 0.9952 1.0059 1.0092 1.0112 1.0223 0.9949 0.9961 0.9966 0.9942 0.9971 0.9969 1.0364
dispcorr: -0.025551381 hartree
energy: -1797.807097896381
dipole: -5.38294 4.05901 -1.32393 13.68164 -12.71248 0.96917 -5.32471 4.21703 -1.10768
magnitude: 1.97965 au
magnitude: 5.03188 debye
