program: Orca
programVersion: 4.2.1
elementType: S O O O O O O O N N N N N N C C C C C C C C C C C C C C H H H H H H H H H H H H H H H H H H
charge: 0
multiplicity: 1
keywords: wb97x-d3
keywords: def2-TZVPP
keywords: def2/J RIJCOSX GRIDX6 NOFINALGRIDX
keywords: grid4 nofinalgrid
keywords: scfconv7
keywords: smallprint printgap noloewdin
keywords: NOSOSCF
formula: C14H18N6O7S
InChI: InChI=1S/C14H18N6O7S/c1-5-27-12(21)8-7-15-20(2)11(8)28(23,24)19-14(22)18-13-16-9(25-3)6-10(17-13)26-4/h6-7,18-19H,5H2,1-4H3
46 atoms
S  1.747923 -1.16168 1.465405
O  1.717382 -0.144682 2.484623
O  2.148683 -2.509575 1.775247
O  2.328031 2.884619 -0.857512
O  0.84525 1.748842 0.378026
O  0.675887 -2.611517 -0.880628
O  -3.048466 1.523983 2.065156
O  -5.58186 -0.083218 -1.476695
N  3.720946 -1.318925 -0.461203
N  0.219363 -1.163839 0.815019
N  4.365515 -0.621631 -1.385198
N  -1.375229 -1.678871 -0.795257
N  -2.189425 -0.066805 0.669656
N  -3.474692 -0.885743 -1.133144
C  2.749962 -0.593391 0.122781
C  2.772772 0.661789 -0.468383
C  3.813819 0.571031 -1.401629
C  4.109291 -2.703631 -0.259728
C  1.871952 1.794303 -0.248479
C  -0.091671 -1.872993 -0.314545
C  1.537023 4.073554 -0.781783
C  -2.384025 -0.834459 -0.388358
C  0.397647 4.073209 -1.779047
C  -3.189143 0.737342 1.018073
C  -4.463448 -0.081257 -0.772592
C  -4.385223 0.776386 0.317834
C  -1.818002 1.507069 2.781629
C  -5.672846 -0.94513 -2.599551
H  4.165825 1.327386 -2.083913
H  -0.439374 -0.444188 1.131999
H  4.885974 -2.905605 -0.988901
H  3.26181 -3.36079 -0.425284
H  4.498084 -2.859222 0.742112
H  2.236594 4.87978 -0.998797
H  1.165474 4.21398 0.234543
H  -0.109513 5.038079 -1.747831
H  0.760387 3.921951 -2.795458
H  -0.338791 3.304472 -1.552241
H  -5.197856 1.42741 0.600824
H  -1.947294 2.213972 3.596478
H  -1.60517 0.521253 3.197297
H  -0.981564 1.820717 2.158213
H  -4.922836 -0.706856 -3.354367
H  -5.561082 -1.992328 -2.31764
H  -6.665258 -0.784818 -3.012255
H  -1.587457 -2.219143 -1.620429
totalener: -1797.78130501 hartree
nucrepener: 3088.31927210 hartree
electener: -4886.10057711 hartree
oneelecener: -8605.12645270 hartree
twoeener: 3719.02587559 hartree
kineticenergy: 1791.42646104 hartree
xcener: -147.482946051080 hartree
chargesum: 0.0000000
charge: 0.854058 -0.435181 -0.437674 -0.271879 -0.424435 -0.393632 -0.262610 -0.264212 0.183034 -0.207008 -0.280968 -0.163919 -0.416360 -0.408852 -0.119170 -0.104456 -0.054078 -0.172723 0.496380 0.349237 0.024051 0.359380 -0.250671 0.400082 0.385011 -0.304666 -0.137367 -0.125161 0.139741 0.221030 0.114533 0.137919 0.122692 0.101798 0.087450 0.084476 0.085729 0.095341 0.128319 0.125793 0.106069 0.126050 0.107354 0.108361 0.123841 0.167293
qa: 0.8541 -0.4352 -0.4377 -0.2719 -0.4244 -0.3936 -0.2626 -0.2642 0.1830 -0.2070 -0.2810 -0.1639 -0.4164 -0.4089 -0.1192 -0.1045 -0.0541 -0.1727 0.4964 0.3492 0.0241 0.3594 -0.2507 0.4001 0.3850 -0.3047 -0.1374 -0.1252 0.1397 0.2210 0.1145 0.1379 0.1227 0.1018 0.0875 0.0845 0.0857 0.0953 0.1283 0.1258 0.1061 0.1261 0.1074 0.1084 0.1238 0.1673
va: 5.9132 2.0669 2.0665 2.1449 2.0624 2.1192 2.1618 2.1482 3.3513 3.0970 2.8977 3.1646 2.9676 2.9716 4.0780 3.7103 4.0986 3.8615 4.1048 4.3926 3.8739 4.2458 3.9120 4.0218 4.0562 3.9377 3.8555 3.8769 1.0147 1.0463 1.0091 0.9978 0.9951 0.9952 1.0107 1.0099 1.0057 1.0124 1.0224 0.9950 0.9962 1.0009 0.9969 0.9970 0.9940 1.0364
dispcorr: -0.025649133 hartree
energy: -1797.806954141788
dipole: -7.65907 6.35494 -1.30413 12.79113 -11.67658 1.11455 -8.83477 7.69639 -1.13838
magnitude: 2.05886 au
magnitude: 5.23321 debye
