program: Orca
programVersion: 4.2.1
elementType: S O O O O O O O N N N N N N C C C C C C C C C C C C C C H H H H H H H H H H H H H H H H H H
charge: 0
multiplicity: 1
keywords: wb97x-d3
keywords: def2-TZVPP
keywords: def2/J RIJCOSX GRIDX6 NOFINALGRIDX
keywords: grid4 nofinalgrid
keywords: scfconv7
keywords: smallprint printgap noloewdin
keywords: NOSOSCF
formula: C14H18N6O7S
InChI: InChI=1S/C14H18N6O7S/c1-5-27-12(21)8-7-15-20(2)11(8)28(23,24)19-14(22)18-13-16-9(25-3)6-10(17-13)26-4/h6-7,18-19H,5H2,1-4H3
46 atoms
S  1.713154 -0.807624 1.586225
O  1.677221 0.435335 2.313482
O  2.136993 -2.026886 2.224276
O  2.310851 2.59081 -1.588305
O  0.77619 1.73368 -0.199989
O  0.62893 -2.811019 -0.312156
O  -3.092343 1.881794 1.615315
O  -5.686706 -0.577177 -1.347743
N  3.658676 -1.43718 -0.270913
N  0.179195 -0.990643 0.97921
N  4.301955 -0.978443 -1.334052
N  -1.435398 -1.907396 -0.415782
N  -2.243571 0.005589 0.629891
N  -3.55837 -1.247373 -0.877064
C  2.697565 -0.586896 0.134176
C  2.72556 0.496808 -0.731521
C  3.75955 0.183487 -1.623246
C  4.038712 -2.73986 0.246054
C  1.827879 1.65266 -0.779648
C  -0.139723 -1.962438 0.068909
C  1.531464 3.774181 -1.782286
C  -2.450221 -1.001528 -0.200524
C  1.722254 4.774991 -0.662755
C  -3.247738 0.860088 0.798559
C  -4.551565 -0.389167 -0.697817
C  -4.461399 0.712052 0.145005
C  -1.842455 2.051966 2.276046
C  -5.793921 -1.69747 -2.211239
H  4.112399 0.757905 -2.464161
H  -0.48856 -0.223668 1.119746
H  4.78317 -3.128555 -0.439975
H  3.17772 -3.399659 0.275445
H  4.465705 -2.65595 1.241183
H  0.47739 3.51688 -1.900238
H  1.8869 4.183145 -2.727448
H  1.18726 5.694046 -0.904317
H  1.334276 4.401914 0.283257
H  2.774288 5.026795 -0.532298
H  -5.277983 1.403925 0.281655
H  -1.610447 1.207655 2.926803
H  -1.025525 2.193906 1.569456
H  -1.954987 2.945644 2.883581
H  -6.793591 -1.646486 -2.63437
H  -5.057025 -1.662624 -3.014036
H  -5.675133 -2.637426 -1.671539
H  -1.656047 -2.635693 -1.078153
totalener: -1797.78169591 hartree
nucrepener: 3077.35323446 hartree
electener: -4875.13493038 hartree
oneelecener: -8583.24468687 hartree
twoeener: 3708.10975649 hartree
kineticenergy: 1791.42615737 hartree
xcener: -147.483205934138 hartree
chargesum: -0.0000000
charge: 0.853764 -0.438633 -0.437694 -0.272146 -0.421497 -0.395848 -0.262955 -0.264204 0.183280 -0.205279 -0.280821 -0.163142 -0.414914 -0.408220 -0.123083 -0.098279 -0.055004 -0.172682 0.489267 0.351481 0.029426 0.358398 -0.252229 0.401949 0.385250 -0.304236 -0.137483 -0.125157 0.140817 0.219513 0.113670 0.138512 0.123032 0.085157 0.098790 0.082903 0.097369 0.088455 0.128096 0.108410 0.123883 0.125693 0.123603 0.107419 0.108168 0.167200
qa: 0.8538 -0.4386 -0.4377 -0.2721 -0.4215 -0.3958 -0.2630 -0.2642 0.1833 -0.2053 -0.2808 -0.1631 -0.4149 -0.4082 -0.1231 -0.0983 -0.0550 -0.1727 0.4893 0.3515 0.0294 0.3584 -0.2522 0.4019 0.3853 -0.3042 -0.1375 -0.1252 0.1408 0.2195 0.1137 0.1385 0.1230 0.0852 0.0988 0.0829 0.0974 0.0885 0.1281 0.1084 0.1239 0.1257 0.1236 0.1074 0.1082 0.1672
va: 5.9140 2.0644 2.0662 2.1442 2.0666 2.1179 2.1621 2.1489 3.3509 3.0969 2.8972 3.1651 2.9728 2.9730 4.0722 3.7022 4.0993 3.8615 4.1156 4.3907 3.8680 4.2480 3.9181 4.0209 4.0552 3.9374 3.8609 3.8773 1.0135 1.0493 1.0091 0.9984 0.9943 1.0132 0.9952 1.0092 1.0111 1.0058 1.0224 0.9962 0.9968 0.9952 0.9941 0.9969 0.9968 1.0365
dispcorr: -0.025491753 hartree
energy: -1797.807187667431
dipole: -4.74287 3.47294 -1.26992 12.97465 -12.13056 0.84408 -6.74558 5.51901 -1.22657
magnitude: 1.95695 au
magnitude: 4.97417 debye
