program: Orca
programVersion: 4.2.1
elementType: S O O O O O O O N N N N N N C C C C C C C C C C C C C C H H H H H H H H H H H H H H H H H H
charge: 0
multiplicity: 1
keywords: wb97x-d3
keywords: def2-TZVPP
keywords: def2/J RIJCOSX GRIDX6 NOFINALGRIDX
keywords: grid4 nofinalgrid
keywords: scfconv7
keywords: smallprint printgap noloewdin
keywords: NOSOSCF
formula: C14H18N6O7S
InChI: InChI=1S/C14H18N6O7S/c1-5-27-12(21)8-7-15-20(2)11(8)28(23,24)19-14(22)18-13-16-9(25-3)6-10(17-13)26-4/h6-7,18-19H,5H2,1-4H3
46 atoms
S  1.762953 -1.177727 1.457853
O  1.730794 -0.170387 2.486358
O  2.180745 -2.523627 1.753175
O  2.270265 2.887146 -0.856636
O  0.825138 1.73393 0.406622
O  0.688515 -2.606703 -0.901299
O  -3.025946 1.486676 2.109876
O  -5.542432 -0.012515 -1.490993
N  3.71475 -1.302399 -0.492574
N  0.229462 -1.18966 0.819982
N  4.342393 -0.592945 -1.41889
N  -1.363059 -1.675673 -0.80076
N  -2.173814 -0.08662 0.690639
N  -3.449915 -0.850413 -1.142436
C  2.745897 -0.588932 0.109601
C  2.751276 0.670879 -0.47232
C  3.780839 0.59526 -1.419597
C  4.112558 -2.686698 -0.309642
C  1.8410 1.792415 -0.236297
C  -0.079887 -1.878588 -0.3224
C  1.460407 4.062881 -0.774879
C  -2.366419 -0.828434 -0.386026
C  0.2953 4.03167 -1.741705
C  -3.165658 0.724595 1.044799
C  -4.43162 -0.039995 -0.775593
C  -4.353095 0.794865 0.332397
C  -1.804657 1.436067 2.840504
C  -5.636132 -0.856198 -2.627408
H  4.118541 1.359514 -2.1003
H  -0.434492 -0.480053 1.150131
H  3.264719 -3.345947 -0.465698
H  4.519848 -2.849149 0.683885
H  4.876826 -2.879514 -1.054401
H  2.140167 4.877957 -1.019958
H  1.113432 4.209937 0.24926
H  0.634006 3.871994 -2.765171
H  -0.423052 3.255083 -1.485484
H  -0.225691 4.989156 -1.710149
H  -5.159572 1.451504 0.619894
H  -1.612741 0.438885 3.238947
H  -0.955846 1.749113 2.233781
H  -1.932943 2.12858 3.667764
H  -5.552896 -1.909477 -2.358235
H  -6.618424 -0.667349 -3.052098
H  -4.869607 -0.625358 -3.367745
H  -1.573433 -2.197597 -1.638151
totalener: -1797.78119313 hartree
nucrepener: 3093.26781650 hartree
electener: -4891.04900963 hartree
oneelecener: -8615.01440650 hartree
twoeener: 3723.96539687 hartree
kineticenergy: 1791.42781671 hartree
xcener: -147.483294788229 hartree
chargesum: 0.0000000
charge: 0.854844 -0.435068 -0.437757 -0.271998 -0.423933 -0.394098 -0.262316 -0.264195 0.183534 -0.207411 -0.281026 -0.163784 -0.414769 -0.408587 -0.121495 -0.103109 -0.054204 -0.172484 0.495559 0.349024 0.023829 0.358324 -0.250872 0.399799 0.385004 -0.304443 -0.138024 -0.125190 0.139956 0.220328 0.138021 0.122743 0.114304 0.101679 0.087835 0.085767 0.095333 0.084587 0.128371 0.106239 0.126723 0.125895 0.108449 0.123884 0.107333 0.167399
qa: 0.8548 -0.4351 -0.4378 -0.2720 -0.4239 -0.3941 -0.2623 -0.2642 0.1835 -0.2074 -0.2810 -0.1638 -0.4148 -0.4086 -0.1215 -0.1031 -0.0542 -0.1725 0.4956 0.3490 0.0238 0.3583 -0.2509 0.3998 0.3850 -0.3044 -0.1380 -0.1252 0.1400 0.2203 0.1380 0.1227 0.1143 0.1017 0.0878 0.0858 0.0953 0.0846 0.1284 0.1062 0.1267 0.1259 0.1084 0.1239 0.1073 0.1674
va: 5.9132 2.0673 2.0666 2.1446 2.0627 2.1185 2.1622 2.1484 3.3510 3.0960 2.8978 3.1644 2.9678 2.9714 4.0791 3.7075 4.0987 3.8612 4.1066 4.3920 3.8740 4.2470 3.9115 4.0211 4.0563 3.9382 3.8549 3.8768 1.0146 1.0485 0.9980 0.9950 1.0091 0.9952 1.0104 1.0057 1.0123 1.0100 1.0223 0.9959 1.0003 0.9951 0.9969 0.9940 0.9970 1.0363
dispcorr: -0.025778633 hartree
energy: -1797.806971758216
dipole: -7.95409 6.61887 -1.33522 12.75062 -11.63015 1.12047 -8.76787 7.63496 -1.13291
magnitude: 2.07888 au
magnitude: 5.28410 debye
