program: Orca
programVersion: 4.2.1
elementType: S O O O O O O O N N N N N N C C C C C C C C C C C C C C H H H H H H H H H H H H H H H H H H
charge: 0
multiplicity: 1
keywords: wb97x-d3
keywords: def2-TZVPP
keywords: def2/J RIJCOSX GRIDX6 NOFINALGRIDX
keywords: grid4 nofinalgrid
keywords: scfconv7
keywords: smallprint printgap noloewdin
keywords: NOSOSCF
formula: C14H18N6O7S
InChI: InChI=1S/C14H18N6O7S/c1-5-27-12(21)8-7-15-20(2)11(8)28(23,24)19-14(22)18-13-16-9(25-3)6-10(17-13)26-4/h6-7,18-19H,5H2,1-4H3
46 atoms
S  1.871121 -0.92507 -1.503235
O  2.318573 -2.204425 -1.98996
O  1.905955 0.24138 -2.347301
O  2.174593 2.685631 1.499933
O  0.837042 1.772319 -0.046385
O  0.63769 -2.72762 0.496869
O  -2.873211 1.839734 -2.039786
O  -5.635594 -0.231062 1.063148
N  3.679596 -1.384898 0.532994
N  0.296181 -1.036066 -0.988429
N  4.234591 -0.843935 1.607659
N  -1.40661 -1.779407 0.40701
N  -2.116871 0.044183 -0.848648
N  -3.518324 -1.011317 0.730424
C  2.750486 -0.576202 -0.008213
C  2.703961 0.56739 0.776607
C  3.664341 0.329026 1.768606
C  4.099295 -2.721364 0.149797
C  1.801984 1.715307 0.670908
C  -0.090837 -1.906907 -0.004583
C  1.360124 3.859355 1.564537
C  -2.382725 -0.868445 0.069629
C  0.131032 3.662965 2.427008
C  -3.085432 0.909639 -1.13177
C  -4.475463 -0.143812 0.436238
C  -4.32183 0.865976 -0.505786
C  -1.603029 1.902457 -2.680784
C  -5.808417 -1.257587 2.026693
H  3.946788 0.966398 2.590463
H  -0.345947 -0.275544 -1.238648
H  4.580083 -2.71666 -0.823993
H  3.246661 -3.392643 0.129542
H  4.807609 -3.040771 0.906246
H  1.083728 4.181126 0.559157
H  2.012224 4.618828 1.993888
H  -0.397142 4.61206 2.524229
H  -0.559195 2.943188 1.990814
H  0.399093 3.328642 3.429073
H  -5.109406 1.566619 -0.736225
H  -1.670875 2.732773 -3.37816
H  -0.798836 2.090127 -1.970554
H  -1.385694 0.989232 -3.236506
H  -5.703445 -2.249128 1.585484
H  -5.097575 -1.166159 2.848398
H  -6.819187 -1.135342 2.40672
H  -1.674001 -2.434184 1.126524
totalener: -1797.78131048 hartree
nucrepener: 3093.51218841 hartree
electener: -4891.29349889 hartree
oneelecener: -8615.50024373 hartree
twoeener: 3724.20674484 hartree
kineticenergy: 1791.42412398 hartree
xcener: -147.482694325693 hartree
chargesum: 0.0000000
charge: 0.854555 -0.437572 -0.435288 -0.272134 -0.424560 -0.393476 -0.262190 -0.264233 0.183841 -0.207488 -0.280566 -0.164293 -0.414495 -0.408541 -0.121861 -0.103399 -0.053901 -0.172950 0.496566 0.348776 0.025081 0.358375 -0.250987 0.400580 0.385485 -0.305176 -0.139076 -0.125082 0.139909 0.219772 0.122770 0.138476 0.113980 0.087046 0.101602 0.084717 0.095248 0.085684 0.128195 0.126125 0.127270 0.106489 0.108250 0.107084 0.123948 0.167441
qa: 0.8546 -0.4376 -0.4353 -0.2721 -0.4246 -0.3935 -0.2622 -0.2642 0.1838 -0.2075 -0.2806 -0.1643 -0.4145 -0.4085 -0.1219 -0.1034 -0.0539 -0.1730 0.4966 0.3488 0.0251 0.3584 -0.2510 0.4006 0.3855 -0.3052 -0.1391 -0.1251 0.1399 0.2198 0.1228 0.1385 0.1140 0.0870 0.1016 0.0847 0.0952 0.0857 0.1282 0.1261 0.1273 0.1065 0.1082 0.1071 0.1239 0.1674
va: 5.9131 2.0665 2.0674 2.1453 2.0620 2.1192 2.1622 2.1484 3.3506 3.0949 2.8980 3.1645 2.9662 2.9718 4.0769 3.7072 4.0984 3.8615 4.1071 4.3926 3.8741 4.2471 3.9120 4.0193 4.0559 3.9384 3.8546 3.8770 1.0145 1.0495 0.9948 0.9979 1.0090 1.0107 0.9952 1.0099 1.0123 1.0058 1.0224 0.9950 0.9998 0.9959 0.9968 0.9971 0.9940 1.0363
dispcorr: -0.025788184 hartree
energy: -1797.807098661797
dipole: -8.68929 7.26669 -1.42260 11.07879 -10.16200 0.91680 10.22104 -9.01109 1.20995
magnitude: 2.08045 au
magnitude: 5.28808 debye
