program: Orca
programVersion: 4.2.1
elementType: S O O O O O O O N N N N N N C C C C C C C C C C C C C C H H H H H H H H H H H H H H H H H H
charge: 0
multiplicity: 1
keywords: wb97x-d3
keywords: def2-TZVPP
keywords: def2/J RIJCOSX GRIDX6 NOFINALGRIDX
keywords: grid4 nofinalgrid
keywords: scfconv7
keywords: smallprint printgap noloewdin
keywords: NOSOSCF
formula: C14H18N6O7S
InChI: InChI=1S/C14H18N6O7S/c1-5-27-12(21)8-7-15-20(2)11(8)28(23,24)19-14(22)18-13-16-9(25-3)6-10(17-13)26-4/h6-7,18-19H,5H2,1-4H3
46 atoms
S  1.877069 -0.924474 -1.507719
O  2.330286 -2.201144 -1.995879
O  1.912064 0.244061 -2.348781
O  2.155444 2.67875 1.507148
O  0.829242 1.766352 -0.049386
O  0.642373 -2.732514 0.485315
O  -2.86582 1.842182 -2.040768
O  -5.617601 -0.21267 1.081917
N  3.67668 -1.384958 0.536277
N  0.300185 -1.041113 -0.999585
N  4.224876 -0.845502 1.615156
N  -1.40137 -1.783284 0.398101
N  -2.110962 0.042669 -0.854464
N  -3.5070 -1.004454 0.734934
C  2.748494 -0.57703 -0.007613
C  2.695007 0.564256 0.780104
C  3.650402 0.325318 1.776748
C  4.101082 -2.719403 0.151617
C  1.790446 1.709968 0.672903
C  -0.086216 -1.911252 -0.014983
C  1.337535 3.850187 1.570022
C  -2.375171 -0.867709 0.066491
C  0.102992 3.648218 2.42338
C  -3.076615 0.913468 -1.131022
C  -4.461452 -0.131942 0.446944
C  -4.308699 0.876907 -0.496193
C  -1.600463 1.897215 -2.691819
C  -5.788992 -1.237447 2.047586
H  3.926933 0.961124 2.60183
H  -0.342445 -0.280877 -1.249545
H  4.587074 -2.710965 -0.819507
H  3.249956 -3.392242 0.124841
H  4.805912 -3.039802 0.910838
H  1.067221 4.17449 0.563786
H  1.984829 4.609925 2.00617
H  -0.428099 4.595734 2.520039
H  -0.582484 2.928275 1.980137
H  0.365047 3.311307 3.426137
H  -5.093906 1.581945 -0.721208
H  -1.392789 0.982216 -3.248339
H  -1.669199 2.727243 -3.389464
H  -0.789696 2.081143 -1.988139
H  -6.795749 -1.10849 2.435869
H  -5.694072 -2.229909 1.606142
H  -5.070767 -1.150154 2.863262
H  -1.667698 -2.436984 1.118964
totalener: -1797.78127353 hartree
nucrepener: 3095.25413425 hartree
electener: -4893.03540778 hartree
oneelecener: -8618.98114431 hartree
twoeener: 3725.94573652 hartree
kineticenergy: 1791.42709728 hartree
xcener: -147.483218616190 hartree
chargesum: -0.0000000
charge: 0.854961 -0.437482 -0.435309 -0.272149 -0.424451 -0.393461 -0.262107 -0.264237 0.184074 -0.207618 -0.280599 -0.164323 -0.414005 -0.408465 -0.122881 -0.102954 -0.053821 -0.172997 0.496473 0.348543 0.024994 0.358111 -0.250846 0.400853 0.385500 -0.305443 -0.139286 -0.125054 0.139930 0.219561 0.122793 0.138550 0.113948 0.087061 0.101654 0.084751 0.095099 0.085675 0.128104 0.106500 0.126158 0.127460 0.123917 0.108289 0.107068 0.167461
qa: 0.8550 -0.4375 -0.4353 -0.2721 -0.4245 -0.3935 -0.2621 -0.2642 0.1841 -0.2076 -0.2806 -0.1643 -0.4140 -0.4085 -0.1229 -0.1030 -0.0538 -0.1730 0.4965 0.3485 0.0250 0.3581 -0.2508 0.4009 0.3855 -0.3054 -0.1393 -0.1251 0.1399 0.2196 0.1228 0.1386 0.1139 0.0871 0.1017 0.0848 0.0951 0.0857 0.1281 0.1065 0.1262 0.1275 0.1239 0.1083 0.1071 0.1675
va: 5.9128 2.0666 2.0675 2.1453 2.0621 2.1191 2.1622 2.1484 3.3505 3.0947 2.8981 3.1644 2.9661 2.9716 4.0775 3.7062 4.0985 3.8614 4.1073 4.3926 3.8742 4.2475 3.9121 4.0186 4.0558 3.9387 3.8546 3.8770 1.0145 1.0500 0.9948 0.9980 1.0091 1.0107 0.9952 1.0099 1.0123 1.0058 1.0224 0.9958 0.9950 0.9996 0.9940 0.9968 0.9971 1.0363
dispcorr: -0.025829955 hartree
energy: -1797.807103489351
dipole: -8.76030 7.33229 -1.42800 11.06061 -10.14414 0.91647 10.24547 -9.03196 1.21351
magnitude: 2.08607 au
magnitude: 5.30238 debye
