program: Gaussian 09
title: 000074178
version: EM64L-G09RevD.01
frameworkgroup: C1[X(C15H24OS)]
method: RPBEPBE
basis: SDD
operation: Freq
keyword: #p
keyword: freq=noraman
keyword: PBEPBE/SDD
title: #p freq=noraman PBEPBE/SDD
converged: NO YES NO NO
title: Mulliken charges:
elementType: S O C C C C C C C C C C C C C C C H H H H H H H H H H H H H H H H H H H H H H H H
charge: -0.045736 -0.430426 0.157714 0.081445 0.347382 0.393378 -0.099230 -0.578500 -0.561752 -0.752603 -0.729791 -0.731354 -0.696815 -0.697202 -0.751838 0.528100 -0.892916 0.264566 0.262792 0.219184 0.219557 0.213475 0.212599 0.200518 0.261362 0.262594 0.208807 0.201070 0.202941 0.238788 0.215904 0.204465 0.215822 0.234044 0.227562 0.220833 0.219174 0.263478 0.265456 0.336660 0.088492
chargesum: 0.00000
title: Mulliken charges with hydrogens summed into heavy atoms:
elementType: S O C C C C C C C C C C C C C C C
charge: 0.042756 -0.093766 0.157714 0.081445 0.347382 0.393378 -0.099230 -0.313934 -0.298961 -0.100387 -0.055311 -0.058882 -0.039182 -0.042870 -0.084269 0.528100 -0.363982
polarizability: 2.03354238e+02 4.47673517e+00 2.20056410e+02 -2.32807360e-01 -3.41020096e+00 1.38339312e+02
1716.lowfreq: -17.1464 -12.2077 -8.6805 -0.0022 -0.0013 -0.0010 28.1077 38.4550 57.8689
frequency: 27.1830 37.7682 57.6134 62.7751 103.0085 123.2465 140.5698 150.4001 154.6204 183.1080 199.3731 215.1897 216.3619 242.9757 260.0333 265.8737 276.0171 302.8191 308.0158 327.7985 334.4401 339.7287 344.8717 376.2761 388.2744 394.2726 400.2402 428.5844 444.1531 466.9610 511.7128 539.5250 580.2930 601.7398 621.4480 667.6688 743.3283 750.5701 782.6932 798.8467 843.5836 874.0755 903.5267 909.2381 914.2342 915.6224 924.8919 928.0986 929.6588 946.1150 947.9216 964.4644 1019.7513 1022.6825 1025.4049 1029.8053 1103.8497 1121.9421 1145.2301 1191.9867 1198.5419 1203.7331 1205.6346 1214.6507 1229.9909 1247.5767 1251.9578 1281.5000 1308.2105 1366.1892 1370.9104 1375.1803 1380.7599 1387.0282 1396.8250 1410.6615 1429.8544 1439.5585 1455.1306 1458.0962 1460.3035 1468.1118 1471.6747 1472.7304 1476.6295 1477.1523 1488.2096 1489.9152 1490.1992 1501.4434 1506.0800 1595.7519 1609.2222 2403.4432 2970.4050 2972.4121 2974.0560 2975.5027 2978.4813 2981.3805 3029.7570 3056.8421 3059.4853 3061.1363 3063.1532 3068.9125 3073.1173 3073.5309 3076.5455 3082.5977 3084.2589 3102.1241 3108.9773 3112.5859 3159.0222 3162.3272 3602.7035
redmass: 5.8789 3.2061 3.3353 2.9275 3.3632 1.2535 1.7548 2.3877 1.4762 1.1921 1.4738 2.1909 2.3740 1.2988 1.7675 2.1750 2.1087 2.7628 2.4853 1.0862 3.8154 1.4145 1.5640 2.4983 2.4693 2.9052 2.2008 2.7394 3.5912 4.3462 2.8694 2.6501 5.5808 3.6554 4.5563 2.8870 4.6979 4.3700 4.4641 2.9964 1.4146 2.1301 1.5654 1.6950 1.6005 1.7316 1.5906 1.7156 1.6860 1.2190 1.2068 3.1448 1.4202 1.3904 1.3848 1.3821 2.7312 1.2332 1.3609 2.5336 2.8690 2.9654 2.6940 3.1641 1.7765 1.1916 2.3762 1.6102 4.3827 1.1898 1.5019 2.7148 1.2390 1.1631 1.2445 1.2108 2.8504 2.5525 1.0489 1.0535 1.1230 1.0717 1.0533 1.0706 1.0523 1.0548 1.1644 1.0518 1.0530 1.0616 1.0627 6.6909 5.8752 1.0383 1.0353 1.0360 1.0366 1.0356 1.0373 1.0360 1.0570 1.0986 1.1000 1.0980 1.0993 1.0998 1.0986 1.0991 1.1005 1.0994 1.0996 1.1093 1.0982 1.0974 1.0899 1.0905 1.0650
irintensity: 0.4853 0.2126 0.2851 1.0409 1.8516 2.8625 14.8502 3.1784 20.8783 1.7021 2.7789 2.1132 3.6710 0.1231 1.8227 36.7216 25.9920 2.6751 0.7738 0.4839 6.0114 5.3526 24.6144 1.8975 0.3899 1.2770 7.1015 0.4800 3.9922 12.3518 0.4227 0.0857 15.8072 5.9465 0.0583 15.1045 2.9782 4.8573 5.2337 7.0787 1.8224 8.9828 2.9421 10.9119 3.9288 6.3591 6.5758 1.4599 9.7323 0.3783 1.6764 1.6255 0.7214 2.8448 0.3940 0.7337 54.1858 9.0575 77.1109 6.3154 9.1179 7.0979 9.1052 82.1575 8.5010 32.0617 63.6889 22.6740 5.7853 23.1344 8.7824 17.1390 22.3557 19.1602 26.4136 25.7329 53.1837 38.7401 0.0790 0.1403 6.1242 2.4360 3.0244 1.4585 0.6052 2.0838 6.4831 2.2287 17.5842 23.8049 16.7420 1.3177 2.1297 70.4371 20.9393 22.1125 46.5863 39.5880 62.0561 16.2006 28.9281 0.7230 8.5053 75.4286 13.1547 49.8875 105.6957 14.6571 5.7393 66.3359 50.6274 8.6439 1.7886 21.2324 6.8842 7.5463 61.9691
temp: 298.150 k
press: 1.00000 atm
elementType: 16 8 6 6 6 6 6 6 6 6 6 6 6 6 6 6 6 1 1 1 1 1 1 1 1 1 1 1 1 1 1 1 1 1 1 1 1 1 1 1 1
symmnumber: 1
zpe: 916247.6 jmol-1
zpe.correction: 0.348980 hartree
zpe.thermalcorrener: 0.369538 hartree
zpe.thermalcorrenthalpy: 0.370482 hartree
zpe.thermalcorrgfe: 0.300764 hartree
zpe.sumelectzpe: -1057.940174 hartree
zpe.sumelectthermal: -1057.919616 hartree
zpe.sumelectthermalent: -1057.918672 hartree
zpe.sumelectthermalfe: -1057.988390 hartree
dipole: 1.9202 -1.1060 -1.5539
dipole: 2.7065
quadrupole: -107.8663 -106.0095 -115.9843
quadrupole: -5.4555 -1.1886 -7.9340
quadrupole: 2.0871 3.9439 -6.0309 -5.4555 -1.1886 -7.9340
hfenergy: -1058.2891544 hartree
pointgroup: C01 [X(C15H24O1S1)]
dipole: 0.8530749 -0.1415908 -0.6213175 debye
polarizability: 202.1708329|-0.3105016|220.2666404|2.0199741|9.2796489|139.3124877 unknown
InChI: InChI=1S/C15H24OS/c1-14(2,3)11-7-10(9-17)8-12(13(11)16)15(4,5)6/h7-8,16-17H,9H2,1-6H3
charge 0 multiplicity 1
41 atoms
S  -0.04222 4.227426 1.449203
O  -0.046029 -2.252983 0.022317
C  -2.611797 -0.965015 -0.119709
C  2.614335 -0.864861 0.003651
C  -1.27215 -0.182814 -0.134381
C  1.241942 -0.134417 -0.074545
C  -0.004443 -0.840293 -0.061504
C  -1.251182 1.228008 -0.221934
C  1.17854 1.275761 -0.165684
C  -3.837193 -0.014807 -0.209331
C  -2.745644 -1.772292 1.208337
C  -2.681546 -1.933367 -1.340784
C  2.752388 -1.650911 1.349143
C  2.815847 -1.808293 -1.227656
C  3.801931 0.138047 -0.026141
C  -0.048316 1.970748 -0.240543
C  -0.073989 3.475291 -0.329055
H  -2.196763 1.77457 -0.272841
H  2.102935 1.859351 -0.171544
H  -4.761184 -0.621178 -0.193756
H  -3.882936 0.684498 0.646098
H  -3.840002 0.572684 -1.146519
H  -2.732765 -1.092316 2.080456
H  -3.706573 -2.321377 1.215016
H  -1.926483 -2.499438 1.31757
H  -1.861397 -2.667102 -1.315311
H  -2.620602 -1.368341 -2.289831
H  -3.643621 -2.480398 -1.328265
H  1.986841 -2.432633 1.511654
H  2.672941 -0.953267 2.201865
H  3.740277 -2.145678 1.396005
H  2.049493 -2.59857 -1.334104
H  3.799572 -2.309169 -1.161347
H  2.790287 -1.218582 -2.161596
H  3.773934 0.834979 0.830594
H  3.817231 0.728864 -0.959767
H  4.752356 -0.423828 0.029718
H  0.808804 3.869198 -0.857777
H  -0.992571 3.83816 -0.816859
H  0.86676 -2.621254 0.086126
H  -0.048507 5.5594 1.05203
