program: Orca
programVersion: 4.2.1
elementType: S O O O O O O O N N N N N N C C C C C C C C C C C C C C H H H H H H H H H H H H H H H H H H
charge: 0
multiplicity: 1
keywords: wb97x-d3
keywords: def2-TZVPP
keywords: def2/J RIJCOSX GRIDX6 NOFINALGRIDX
keywords: grid4 nofinalgrid
keywords: scfconv7
keywords: smallprint printgap noloewdin
keywords: NOSOSCF
formula: C14H18N6O7S
InChI: InChI=1S/C14H18N6O7S/c1-5-27-12(21)8-7-15-20(2)11(8)28(23,24)19-14(22)18-13-16-9(25-3)6-10(17-13)26-4/h6-7,18-19H,5H2,1-4H3
46 atoms
S  1.763655 -0.919881 1.458261
O  1.734838 0.254054 2.292697
O  2.234663 -2.18066 1.970299
O  2.106942 2.715014 -1.497122
O  0.692674 1.731783 -0.065804
O  0.646831 -2.774483 -0.564113
O  -3.078675 1.688928 1.848317
O  -5.669598 -0.454348 -1.352091
N  3.65461 -1.335041 -0.511791
N  0.210413 -1.08316 0.895665
N  4.240224 -0.775001 -1.559959
N  -1.428149 -1.890265 -0.539477
N  -2.232707 -0.086698 0.688227
N  -3.546218 -1.178221 -0.940868
C  2.683369 -0.552516 -0.007185
C  2.641205 0.59339 -0.788369
C  3.64878 0.384871 -1.739218
C  4.094301 -2.660199 -0.113481
C  1.706517 1.717712 -0.714703
C  -0.121305 -1.97355 -0.090502
C  1.2817 3.880819 -1.570432
C  -2.439855 -1.005258 -0.239077
C  1.509762 4.818821 -0.404636
C  -3.23383 0.752128 0.935164
C  -4.536731 -0.337574 -0.681638
C  -4.445493 0.674596 0.265995
C  -1.832858 1.787372 2.530611
C  -5.772863 -1.473739 -2.332915
H  3.949165 1.03328 -2.545953
H  -0.462963 -0.343121 1.123743
H  4.828616 -2.966078 -0.850417
H  3.257127 -3.350652 -0.112038
H  4.550341 -2.641485 0.87206
H  0.230671 3.595178 -1.641097
H  1.565613 4.357248 -2.508066
H  1.199189 4.373381 0.53856
H  2.558246 5.10474 -0.326426
H  0.926342 5.728105 -0.552601
H  -5.259329 1.354042 0.46655
H  -1.609585 0.881765 3.096318
H  -1.01071 1.994486 1.846458
H  -1.945857 2.617422 3.222489
H  -5.036531 -1.347479 -3.127055
H  -5.64995 -2.466875 -1.900416
H  -6.772732 -1.380532 -2.748252
H  -1.653155 -2.553785 -1.265403
totalener: -1797.78152077 hartree
nucrepener: 3082.24180405 hartree
electener: -4880.02332483 hartree
oneelecener: -8593.01237698 hartree
twoeener: 3712.98905216 hartree
kineticenergy: 1791.42778316 hartree
xcener: -147.483383901442 hartree
chargesum: 0.0000000
charge: 0.854209 -0.437921 -0.437323 -0.272489 -0.422710 -0.393889 -0.262751 -0.264410 0.183634 -0.205466 -0.280741 -0.164630 -0.414478 -0.408212 -0.122417 -0.100056 -0.055292 -0.173226 0.491788 0.349381 0.029015 0.358479 -0.252269 0.403139 0.385499 -0.305757 -0.136692 -0.124710 0.140269 0.219334 0.113798 0.138808 0.122880 0.084975 0.099632 0.097979 0.088014 0.082733 0.128203 0.107787 0.123259 0.126337 0.107482 0.108037 0.123433 0.167334
qa: 0.8542 -0.4379 -0.4373 -0.2725 -0.4227 -0.3939 -0.2628 -0.2644 0.1836 -0.2055 -0.2807 -0.1646 -0.4145 -0.4082 -0.1224 -0.1001 -0.0553 -0.1732 0.4918 0.3494 0.0290 0.3585 -0.2523 0.4031 0.3855 -0.3058 -0.1367 -0.1247 0.1403 0.2193 0.1138 0.1388 0.1229 0.0850 0.0996 0.0980 0.0880 0.0827 0.1282 0.1078 0.1233 0.1263 0.1075 0.1080 0.1234 0.1673
va: 5.9139 2.0649 2.0665 2.1445 2.0652 2.1193 2.1618 2.1485 3.3494 3.0966 2.8970 3.1653 2.9708 2.9728 4.0729 3.7006 4.1001 3.8613 4.1137 4.3936 3.8676 4.2486 3.9180 4.0192 4.0557 3.9391 3.8611 3.8772 1.0139 1.0492 1.0090 0.9980 0.9944 1.0130 0.9952 1.0113 1.0059 1.0092 1.0224 0.9961 0.9961 0.9949 0.9970 0.9969 0.9942 1.0364
dispcorr: -0.025561514 hartree
energy: -1797.807082286370
dipole: -5.33544 4.01284 -1.32260 13.51121 -12.57286 0.93835 -5.83955 4.69388 -1.14568
magnitude: 1.98553 au
magnitude: 5.04682 debye
