program: Orca
programVersion: 4.2.1
elementType: S O O O O O O O N N N N N N C C C C C C C C C C C C C C H H H H H H H H H H H H H H H H H H
charge: 0
multiplicity: 1
keywords: wb97x-d3
keywords: def2-TZVPP
keywords: def2/J RIJCOSX GRIDX6 NOFINALGRIDX
keywords: grid4 nofinalgrid
keywords: scfconv7
keywords: smallprint printgap noloewdin
keywords: NOSOSCF
formula: C14H18N6O7S
InChI: InChI=1S/C14H18N6O7S/c1-5-27-12(21)8-7-15-20(2)11(8)28(23,24)19-14(22)18-13-16-9(25-3)6-10(17-13)26-4/h6-7,18-19H,5H2,1-4H3
46 atoms
S  1.778551 -0.846158 -1.428194
O  2.208854 -2.090028 -2.012813
O  1.791836 0.376198 -2.190618
O  2.377948 2.688514 1.5680
O  0.829103 1.776544 0.230899
O  0.570585 -2.810156 0.438121
O  -3.019309 1.867196 -1.769328
O  -5.842345 -0.66533 0.907262
N  3.63006 -1.451267 0.531627
N  0.218357 -0.989882 -0.882346
N  4.246389 -0.961893 1.596925
N  -1.497462 -1.91269 0.382893
N  -2.233792 -0.003533 -0.72146
N  -3.665643 -1.292713 0.642332
C  2.708302 -0.594949 0.053587
C  2.736131 0.525984 0.869907
C  3.727652 0.226743 1.812727
C  3.998858 -2.78155 0.081558
C  1.873129 1.708488 0.825788
C  -0.168164 -1.962706 0.000279
C  1.642916 3.912812 1.649677
C  -2.502181 -1.022074 0.076967
C  1.877015 4.800863 0.445941
C  -3.232955 0.834507 -0.979769
C  -4.652511 -0.45063 0.37393
C  -4.501189 0.659489 -0.448039
C  -1.716742 2.065363 -2.308743
C  -6.012835 -1.794536 1.748605
H  4.066104 0.829251 2.63981
H  -0.433293 -0.221477 -1.075145
H  4.474678 -2.745439 -0.894249
H  3.123356 -3.420523 0.034319
H  4.699748 -3.162739 0.815982
H  2.010115 4.391249 2.556839
H  0.579343 3.707205 1.782545
H  1.484652 4.355943 -0.466646
H  1.371716 5.755424 0.596424
H  2.938135 5.004293 0.305044
H  -5.313304 1.338157 -0.658095
H  -1.409385 1.231917 -2.941966
H  -1.788322 2.962888 -2.916901
H  -0.971533 2.214381 -1.528136
H  -5.816766 -2.727465 1.219399
H  -5.364665 -1.749027 2.624237
H  -7.05203 -1.769307 2.065506
H  -1.765926 -2.646797 1.020727
totalener: -1797.78175648 hartree
nucrepener: 3068.76913107 hartree
electener: -4866.55088754 hartree
oneelecener: -8566.08182902 hartree
twoeener: 3699.53094148 hartree
kineticenergy: 1791.42461173 hartree
xcener: -147.482893368727 hartree
chargesum: -0.0000000
charge: 0.851779 -0.437590 -0.439004 -0.271654 -0.420604 -0.397711 -0.263436 -0.263958 0.182322 -0.204962 -0.280596 -0.163821 -0.418413 -0.408913 -0.118962 -0.097531 -0.055545 -0.173298 0.486343 0.354964 0.028094 0.361061 -0.252293 0.400845 0.384039 -0.303097 -0.135469 -0.125469 0.140309 0.221842 0.122553 0.139319 0.113713 0.099547 0.085603 0.097448 0.082715 0.088849 0.128578 0.107903 0.125441 0.122255 0.107975 0.107519 0.124000 0.167310
qa: 0.8518 -0.4376 -0.4390 -0.2717 -0.4206 -0.3977 -0.2634 -0.2640 0.1823 -0.2050 -0.2806 -0.1638 -0.4184 -0.4089 -0.1190 -0.0975 -0.0555 -0.1733 0.4863 0.3550 0.0281 0.3611 -0.2523 0.4008 0.3840 -0.3031 -0.1355 -0.1255 0.1403 0.2218 0.1226 0.1393 0.1137 0.0995 0.0856 0.0974 0.0827 0.0888 0.1286 0.1079 0.1254 0.1223 0.1080 0.1075 0.1240 0.1673
va: 5.9163 2.0667 2.0640 2.1444 2.0696 2.1163 2.1616 2.1489 3.3515 3.0989 2.8961 3.1658 2.9726 2.9719 4.0672 3.7101 4.0984 3.8620 4.1146 4.3883 3.8685 4.2449 3.9183 4.0245 4.0570 3.9376 3.8619 3.8772 1.0136 1.0441 0.9945 0.9982 1.0091 0.9954 1.0128 1.0112 1.0093 1.0057 1.0222 0.9971 0.9950 0.9986 0.9969 0.9969 0.9940 1.0365
dispcorr: -0.025327150 hartree
energy: -1797.807083627116
dipole: -4.64655 3.34538 -1.30117 13.11827 -12.24073 0.87755 5.42666 -4.35130 1.07535
magnitude: 1.90250 au
magnitude: 4.83578 debye
