program: Orca
programVersion: 4.2.1
elementType: S O O O O O O O N N N N N N C C C C C C C C C C C C C C H H H H H H H H H H H H H H H H H H
charge: 0
multiplicity: 1
keywords: wb97x-d3
keywords: def2-TZVPP
keywords: def2/J RIJCOSX GRIDX6 NOFINALGRIDX
keywords: grid4 nofinalgrid
keywords: scfconv7
keywords: smallprint printgap noloewdin
keywords: NOSOSCF
formula: C14H18N6O7S
InChI: InChI=1S/C14H18N6O7S/c1-5-27-12(21)8-7-15-20(2)11(8)28(23,24)19-14(22)18-13-16-9(25-3)6-10(17-13)26-4/h6-7,18-19H,5H2,1-4H3
46 atoms
S  1.748194 -0.909918 1.446305
O  1.71541 0.26491 2.279516
O  2.21101 -2.171828 1.96319
O  2.152721 2.73546 -1.483176
O  0.704878 1.749744 -0.087343
O  0.639927 -2.765978 -0.581788
O  -3.094484 1.694583 1.821159
O  -5.707107 -0.509585 -1.320211
N  3.651877 -1.335209 -0.509367
N  0.200217 -1.068895 0.870857
N  4.248349 -0.778118 -1.552994
N  -1.437453 -1.887123 -0.558334
N  -2.244563 -0.080978 0.664088
N  -3.56942 -1.203611 -0.934178
C  2.682656 -0.546467 -0.010551
C  2.654419 0.60095 -0.789945
C  3.666897 0.386575 -1.73424
C  4.081841 -2.662828 -0.107939
C  1.729596 1.73362 -0.718743
C  -0.129568 -1.964688 -0.111385
C  1.342676 3.912039 -1.554083
C  -2.454884 -1.011224 -0.250928
C  1.568403 4.833414 -0.374477
C  -3.252063 0.747819 0.918877
C  -4.566138 -0.372361 -0.667851
C  -4.472763 0.649534 0.269003
C  -1.838437 1.816865 2.480472
C  -5.812348 -1.54143 -2.287919
H  3.977656 1.033838 -2.537978
H  -0.474025 -0.32759 1.093241
H  4.525492 -2.647347 0.883272
H  4.824314 -2.969821 -0.836246
H  3.242138 -3.350237 -0.118183
H  0.28915 3.640604 -1.641199
H  1.644514 4.39565 -2.482427
H  1.23711 4.382449 0.559137
H  2.620097 5.101414 -0.277677
H  1.001906 5.753706 -0.520435
H  -5.291405 1.321239 0.476072
H  -1.59424 0.92163 3.054074
H  -1.030646 2.024437 1.779573
H  -1.949513 2.65462 3.163331
H  -5.086539 -1.417721 -3.092196
H  -5.67465 -2.528139 -1.844958
H  -6.818021 -1.462597 -2.692057
H  -1.663758 -2.557213 -1.27782
totalener: -1797.78161376 hartree
nucrepener: 3079.60685372 hartree
electener: -4877.38846748 hartree
oneelecener: -8587.74785493 hartree
twoeener: 3710.35938746 hartree
kineticenergy: 1791.42715452 hartree
xcener: -147.483342881679 hartree
chargesum: 0.0000000
charge: 0.853613 -0.438315 -0.437544 -0.272331 -0.422498 -0.394076 -0.262884 -0.264326 0.183552 -0.205265 -0.280647 -0.164311 -0.414699 -0.408531 -0.122124 -0.099273 -0.055695 -0.173585 0.491368 0.350123 0.028646 0.358721 -0.252429 0.402222 0.385517 -0.305011 -0.136606 -0.124759 0.140225 0.219515 0.122892 0.113780 0.139050 0.085170 0.099585 0.097884 0.088268 0.082767 0.128314 0.107928 0.123326 0.126042 0.107452 0.108059 0.123535 0.167355
qa: 0.8536 -0.4383 -0.4375 -0.2723 -0.4225 -0.3941 -0.2629 -0.2643 0.1836 -0.2053 -0.2806 -0.1643 -0.4147 -0.4085 -0.1221 -0.0993 -0.0557 -0.1736 0.4914 0.3501 0.0286 0.3587 -0.2524 0.4022 0.3855 -0.3050 -0.1366 -0.1248 0.1402 0.2195 0.1229 0.1138 0.1391 0.0852 0.0996 0.0979 0.0883 0.0828 0.1283 0.1079 0.1233 0.1260 0.1075 0.1081 0.1235 0.1674
va: 5.9148 2.0644 2.0664 2.1444 2.0658 2.1194 2.1619 2.1488 3.3498 3.0964 2.8971 3.1655 2.9719 2.9725 4.0726 3.7010 4.1000 3.8612 4.1131 4.3928 3.8678 4.2481 3.9181 4.0204 4.0558 3.9384 3.8608 3.8770 1.0139 1.0491 0.9946 1.0090 0.9978 1.0131 0.9952 1.0112 1.0058 1.0092 1.0223 0.9963 0.9967 0.9950 0.9970 0.9969 0.9942 1.0364
dispcorr: -0.025522209 hartree
energy: -1797.807135966691
dipole: -5.16308 3.85151 -1.31157 13.48383 -12.55034 0.93348 -5.68428 4.54844 -1.13584
magnitude: 1.97021 au
magnitude: 5.00789 debye
