program: Orca
programVersion: 4.2.1
elementType: S O O O O O O O N N N N N N C C C C C C C C C C C C C C H H H H H H H H H H H H H H H H H H
charge: 0
multiplicity: 1
keywords: wb97x-d3
keywords: def2-TZVPP
keywords: def2/J RIJCOSX GRIDX6 NOFINALGRIDX
keywords: grid4 nofinalgrid
keywords: scfconv7
keywords: smallprint printgap noloewdin
keywords: NOSOSCF
formula: C14H18N6O7S
InChI: InChI=1S/C14H18N6O7S/c1-5-27-12(21)8-7-15-20(2)11(8)28(23,24)19-14(22)18-13-16-9(25-3)6-10(17-13)26-4/h6-7,18-19H,5H2,1-4H3
46 atoms
S  1.748888 -0.886668 1.482028
O  1.719994 0.305449 2.290279
O  2.204112 -2.139579 2.02668
O  2.170092 2.690576 -1.52977
O  0.723406 1.74417 -0.105785
O  0.637195 -2.781057 -0.506532
O  -3.090084 1.743187 1.786405
O  -5.693079 -0.507534 -1.329535
N  3.655838 -1.361738 -0.458949
N  0.200828 -1.050118 0.905768
N  4.259385 -0.828349 -1.51077
N  -1.43618 -1.892999 -0.510692
N  -2.242073 -0.059297 0.670336
N  -3.561654 -1.205648 -0.915623
C  2.688412 -0.558558 0.020082
C  2.66852 0.572964 -0.782649
C  3.683583 0.334761 -1.718397
C  4.076763 -2.683639 -0.029981
C  1.746292 1.709215 -0.739365
C  -0.130405 -1.966101 -0.056772
C  1.361429 3.866166 -1.628522
C  -2.450944 -1.005873 -0.227927
C  1.5932 4.818329 -0.474873
C  -3.246849 0.779593 0.901878
C  -4.555523 -0.364149 -0.672393
C  -4.463483 0.67503 0.245516
C  -1.839871 1.867493 2.456237
C  -5.798745 -1.557029 -2.27788
H  4.000853 0.964368 -2.533549
H  -0.470272 -0.302026 1.112743
H  4.52334 -2.650007 0.959478
H  4.814856 -3.012183 -0.753287
H  3.231889 -3.364557 -0.023149
H  0.307225 3.593874 -1.703547
H  1.659581 4.324409 -2.570812
H  2.644578 5.092506 -0.393514
H  1.021917 5.732398 -0.63977
H  1.270978 4.390245 0.472555
H  -5.2804 1.354366 0.433596
H  -1.023947 2.060428 1.760515
H  -1.952666 2.715512 3.126025
H  -1.606849 0.979084 3.044831
H  -5.069755 -1.451095 -3.081763
H  -5.666573 -2.535782 -1.816209
H  -6.802606 -1.481998 -2.687226
H  -1.661616 -2.577372 -1.216841
totalener: -1797.78160223 hartree
nucrepener: 3079.30224878 hartree
electener: -4877.08385102 hartree
oneelecener: -8587.13891426 hartree
twoeener: 3710.05506325 hartree
kineticenergy: 1791.42636094 hartree
xcener: -147.483149827685 hartree
chargesum: 0.0000000
charge: 0.853635 -0.437876 -0.437432 -0.272456 -0.422345 -0.394497 -0.262821 -0.264349 0.183510 -0.205371 -0.280573 -0.164279 -0.415255 -0.408292 -0.121655 -0.100411 -0.055420 -0.173406 0.491291 0.350217 0.028964 0.358908 -0.252091 0.402371 0.385258 -0.304985 -0.136635 -0.124836 0.140435 0.219821 0.123023 0.113640 0.138983 0.085018 0.099601 0.088188 0.082580 0.097781 0.128228 0.123086 0.126163 0.107926 0.107492 0.107996 0.123526 0.167343
qa: 0.8536 -0.4379 -0.4374 -0.2725 -0.4223 -0.3945 -0.2628 -0.2643 0.1835 -0.2054 -0.2806 -0.1643 -0.4153 -0.4083 -0.1217 -0.1004 -0.0554 -0.1734 0.4913 0.3502 0.0290 0.3589 -0.2521 0.4024 0.3853 -0.3050 -0.1366 -0.1248 0.1404 0.2198 0.1230 0.1136 0.1390 0.0850 0.0996 0.0882 0.0826 0.0978 0.1282 0.1231 0.1262 0.1079 0.1075 0.1080 0.1235 0.1673
va: 5.9144 2.0650 2.0665 2.1445 2.0656 2.1189 2.1617 2.1487 3.3499 3.0972 2.8971 3.1653 2.9710 2.9727 4.0721 3.7025 4.0999 3.8613 4.1140 4.3928 3.8672 4.2477 3.9184 4.0201 4.0559 3.9383 3.8611 3.8772 1.0138 1.0481 0.9944 1.0090 0.9980 1.0132 0.9952 1.0058 1.0093 1.0114 1.0223 0.9967 0.9950 0.9961 0.9969 0.9969 0.9942 1.0364
dispcorr: -0.025497987 hartree
energy: -1797.807100219867
dipole: -5.13178 3.82305 -1.30873 13.36407 -12.45372 0.91035 -6.02672 4.86625 -1.16047
magnitude: 1.97185 au
magnitude: 5.01205 debye
