program: Gaussian 09
title: 000074161
version: EM64L-G09RevD.01
frameworkgroup: C1[X(C10H18O4S2)]
method: RPBEPBE
basis: SDD
operation: Freq
keyword: #p
keyword: freq=noraman
keyword: PBEPBE/SDD
title: #p freq=noraman PBEPBE/SDD
converged: YES YES NO NO
title: Mulliken charges:
elementType: S S O O O O C C C C C C C C C C H H H H H H H H H H H H H H H H H H
charge: 0.033502 0.033485 -0.262253 -0.262257 -0.249793 -0.249791 -0.427846 -0.427832 -0.686005 -0.686000 0.262386 0.262386 -0.228041 -0.228046 -0.671587 -0.671582 0.268937 0.260097 0.268936 0.260091 0.285128 0.282941 0.285099 0.282967 0.228615 0.229898 0.228620 0.229890 0.230584 0.231283 0.212164 0.230581 0.231285 0.212162
chargesum: 0.00000
title: Mulliken charges with hydrogens summed into heavy atoms:
elementType: S S O O O O C C C C C C C C C C
charge: 0.033502 0.033485 -0.262253 -0.262257 -0.249793 -0.249791 0.101188 0.101194 -0.117936 -0.117935 0.262386 0.262386 0.230471 0.230464 0.002444 0.002446
polarizability: 2.15600755e+02 6.33424733e-03 1.31721578e+02 -1.37607265e+00 -1.59241190e-03 1.39685435e+02
1716.lowfreq: -5.1142 -2.7297 -0.0019 -0.0014 -0.0013 3.0131 4.4104 8.7638 12.3316
frequency: -3.1020 3.3624 12.3115 28.6143 42.9489 50.0875 51.1485 73.2514 77.2354 93.5117 110.8376 128.1826 148.7396 158.7140 206.7448 217.0351 219.1885 249.7101 249.8309 273.2905 283.5437 344.8187 346.6697 407.4590 420.8377 427.6147 553.3897 553.5937 624.2888 625.4195 714.8963 716.2210 756.5495 757.2992 798.1445 798.1831 818.3058 818.3194 910.3676 910.5636 977.8028 981.7307 1020.1371 1020.4067 1074.5894 1076.2254 1112.9992 1113.0670 1134.5337 1135.2830 1135.4065 1137.4688 1138.5359 1138.7761 1233.5609 1241.2795 1248.6464 1248.6832 1266.6167 1269.7831 1327.1686 1333.1351 1358.6215 1359.4659 1400.2429 1400.2886 1432.1746 1432.2890 1442.9467 1443.6200 1462.8140 1462.8251 1474.0103 1474.0356 1486.7359 1486.7499 1632.2638 1632.9184 2996.2919 2996.3095 3002.8761 3003.0686 3010.6886 3010.7083 3031.2704 3031.3455 3058.0232 3058.1760 3069.1701 3069.1797 3093.1163 3093.1359 3108.0921 3108.1038 3110.9990 3111.3707
redmass: 4.3879 4.5521 6.5213 4.7417 5.0256 3.1222 3.4119 2.4570 2.2872 4.9333 3.4298 2.4724 1.9941 2.3635 4.2235 4.8213 4.9376 1.2965 1.2830 5.9557 8.3763 4.2895 4.4287 9.1216 3.9473 5.0328 2.6169 2.6256 7.2452 7.4087 5.0273 5.1701 1.3369 1.3461 1.0977 1.0977 3.6014 3.5928 6.0396 6.0051 1.6918 1.7245 2.2920 2.2881 4.1765 4.1451 2.2695 2.2673 2.6635 1.4736 1.5215 2.7942 1.1946 1.1750 1.2817 1.2703 1.1364 1.1366 1.1294 1.1410 1.5558 1.5088 1.4708 1.5001 1.2660 1.2661 1.0936 1.0922 1.0906 1.0915 1.0402 1.0402 1.0604 1.0605 1.0691 1.0691 9.5170 9.5915 1.0358 1.0358 1.0615 1.0616 1.0582 1.0582 1.0596 1.0601 1.0986 1.0984 1.1067 1.1067 1.0986 1.0986 1.1026 1.1026 1.1048 1.1041
irintensity: 1.5156 0.5480 0.1063 0.5846 0.7517 0.6123 0.0127 0.2266 0.3250 0.7210 0.2671 0.1112 11.8521 2.7541 11.5304 21.5210 0.0458 2.2957 0.8702 1.9922 0.0955 17.7192 2.5029 0.1366 9.9695 0.1072 1.7928 0.7109 5.1124 20.0021 1.1152 14.0192 27.9995 6.1462 3.5602 3.6921 11.1770 6.6769 39.4674 0.1437 0.0121 0.6355 85.1658 18.4634 120.0001 4.2341 19.6597 3.8074 607.6789 4.2067 65.2224 5.6113 0.0133 4.6954 89.6475 0.0137 0.0486 0.0155 6.5054 0.0795 220.7508 7.4152 21.5700 4.1314 23.0117 14.4179 3.7191 2.6462 20.8388 59.8616 11.6407 12.7858 4.4484 5.3632 11.8041 15.1500 150.3908 188.2035 39.6330 2.9437 30.8198 0.6114 10.7751 25.1524 5.3021 8.7133 0.4512 1.6644 7.4448 8.9014 21.4984 38.1366 22.9232 62.0574 11.8731 1.9617
temp: 298.150 k
press: 1.00000 atm
elementType: 16 16 8 8 8 8 6 6 6 6 6 6 6 6 6 6 1 1 1 1 1 1 1 1 1 1 1 1 1 1 1 1 1 1
symmnumber: 1
zpe: 709929.8 jmol-1
zpe.correction: 0.270398 hartree
zpe.thermalcorrener: 0.290608 hartree
zpe.thermalcorrenthalpy: 0.291552 hartree
zpe.thermalcorrgfe: 0.214612 hartree
zpe.sumelectzpe: -1487.606082 hartree
zpe.sumelectthermal: -1487.585872 hartree
zpe.sumelectthermalent: -1487.584928 hartree
zpe.sumelectthermalfe: -1487.661869 hartree
dipole: 0.0005 0.0687 -0.0017
dipole: 0.0687
quadrupole: -73.3689 -121.4986 -111.7794
quadrupole: 0.0019 5.9025 0.0051
quadrupole: 28.8467 -19.2830 -9.5638 0.0019 5.9025 0.0051
hfenergy: -1487.8764803 hartree
pointgroup: C01 [X(C10H18O4S2)]
dipole: -0.0001984 -0.0270252 -0.0007636 debye
polarizability: 215.5889922|-0.0013637|131.7216596|1.6692617|-0.0255534|139.6971163 unknown
InChI: InChI=1S/C10H18O4S2/c1-3-13-9(11)5-7-15-16-8-6-10(12)14-4-2/h3-8H2,1-2H3
charge 0 multiplicity 1
34 atoms
S  0.231486 -1.802802 1.105533
S  -0.231798 -1.794826 -1.119287
O  5.048553 -0.129163 -0.138701
O  -5.048842 -0.129844 0.136459
O  3.800205 1.322085 1.192277
O  -3.799603 1.331869 -1.182191
C  2.836019 -0.837508 0.451476
C  -2.836313 -0.833997 -0.458668
C  1.552486 -0.446225 1.191693
C  -1.552582 -0.437417 -1.195684
C  3.902927 0.242229 0.563375
C  -3.902828 0.246984 -0.562088
C  6.18697 0.844572 -0.105997
C  -6.187033 0.844364 0.111253
C  7.307528 0.23807 -0.943457
C  -7.308362 0.23079 0.942525
H  2.62188 -1.016719 -0.619683
H  3.24714 -1.785702 0.844947
H  -2.622351 -1.021697 0.611071
H  -3.247792 -1.77891 -0.859598
H  1.726209 -0.313766 2.274569
H  1.123504 0.489171 0.800597
H  -1.726043 -0.296926 -2.277584
H  -1.123497 0.494969 -0.797575
H  6.478818 0.999199 0.948576
H  5.828407 1.809254 -0.508258
H  -6.478028 1.008164 -0.942172
H  -5.828621 1.805462 0.522128
H  7.629231 -0.732536 -0.52892
H  6.979981 0.07981 -1.985084
H  8.178283 0.91881 -0.951969
H  -7.629766 -0.736166 0.519325
H  -6.981701 0.063496 1.983019
H  -8.179067 0.911508 0.956191
