program: Orca
programVersion: 4.2.1
elementType: S O O O O O O O N N N N N N C C C C C C C C C C C C C C H H H H H H H H H H H H H H H H H H
charge: 0
multiplicity: 1
keywords: wb97x-d3
keywords: def2-TZVPP
keywords: def2/J RIJCOSX GRIDX6 NOFINALGRIDX
keywords: grid4 nofinalgrid
keywords: scfconv7
keywords: smallprint printgap noloewdin
keywords: NOSOSCF
formula: C14H18N6O7S
InChI: InChI=1S/C14H18N6O7S/c1-5-27-12(21)8-7-15-20(2)11(8)28(23,24)19-14(22)18-13-16-9(25-3)6-10(17-13)26-4/h6-7,18-19H,5H2,1-4H3
46 atoms
S  1.809838 -0.832454 -1.437704
O  2.286049 -2.06439 -2.011486
O  1.816083 0.390322 -2.199267
O  2.111875 2.621711 1.727762
O  0.722542 1.73569 0.210878
O  0.611359 -2.799194 0.428568
O  -3.003833 1.817857 -1.857387
O  -5.749658 -0.544748 1.04568
N  3.634893 -1.389308 0.559038
N  0.239267 -1.013863 -0.933948
N  4.195185 -0.900103 1.655347
N  -1.460449 -1.908368 0.371714
N  -2.209672 -0.028407 -0.773726
N  -3.601808 -1.231312 0.704459
C  2.688385 -0.565211 0.073684
C  2.637126 0.533433 0.919438
C  3.613371 0.255796 1.885145
C  4.070712 -2.69473 0.096202
C  1.71923 1.673386 0.882955
C  -0.134861 -1.966014 -0.023725
C  1.303508 3.796363 1.837304
C  -2.460475 -1.00839 0.076909
C  1.584798 4.788741 0.729468
C  -3.202099 0.821136 -1.019166
C  -4.582923 -0.378789 0.447883
C  -4.447954 0.694265 -0.424533
C  -1.722619 1.967956 -2.459927
C  -5.897513 -1.626362 1.951381
H  3.897674 0.851434 2.737149
H  -0.423368 -0.258441 -1.142688
H  4.782484 -3.051162 0.832582
H  4.55222 -2.625117 -0.874773
H  3.226456 -3.373674 0.034036
H  1.565305 4.218615 2.806779
H  0.246305 3.526408 1.860286
H  2.639692 5.059777 0.699747
H  1.298708 4.397593 -0.245168
H  1.011281 5.699387 0.90509
H  -5.254675 1.382463 -0.624115
H  -1.80418 2.841456 -3.100873
H  -0.941874 2.133848 -1.718357
H  -1.459232 1.103333 -3.070671
H  -5.208569 -1.546238 2.792804
H  -6.920294 -1.567152 2.313823
H  -5.739424 -2.588565 1.463705
H  -1.718601 -2.618253 1.040473
totalener: -1797.78161235 hartree
nucrepener: 3079.11670898 hartree
electener: -4876.89832132 hartree
oneelecener: -8586.76863028 hartree
twoeener: 3709.87030896 hartree
kineticenergy: 1791.42838877 hartree
xcener: -147.483600570251 hartree
chargesum: 0.0000000
charge: 0.853848 -0.438033 -0.438088 -0.272350 -0.422107 -0.394276 -0.262830 -0.264154 0.183288 -0.205149 -0.280576 -0.164454 -0.415229 -0.408395 -0.122091 -0.099979 -0.055056 -0.172208 0.490928 0.350092 0.028900 0.359245 -0.251980 0.402319 0.385044 -0.305020 -0.136221 -0.125032 0.140326 0.219897 0.113764 0.122535 0.138114 0.099700 0.084935 0.088151 0.097700 0.082602 0.128373 0.126159 0.123120 0.107775 0.107495 0.123828 0.107787 0.167303
qa: 0.8538 -0.4380 -0.4381 -0.2723 -0.4221 -0.3943 -0.2628 -0.2642 0.1833 -0.2051 -0.2806 -0.1645 -0.4152 -0.4084 -0.1221 -0.1000 -0.0551 -0.1722 0.4909 0.3501 0.0289 0.3592 -0.2520 0.4023 0.3850 -0.3050 -0.1362 -0.1250 0.1403 0.2199 0.1138 0.1225 0.1381 0.0997 0.0849 0.0882 0.0977 0.0826 0.1284 0.1262 0.1231 0.1078 0.1075 0.1238 0.1078 0.1673
va: 5.9144 2.0660 2.0647 2.1445 2.0656 2.1192 2.1618 2.1488 3.3508 3.0969 2.8974 3.1653 2.9718 2.9724 4.0727 3.7022 4.1000 3.8622 4.1140 4.3933 3.8673 4.2476 3.9182 4.0212 4.0564 3.9392 3.8609 3.8773 1.0138 1.0484 1.0091 0.9948 0.9982 0.9951 1.0133 1.0058 1.0113 1.0092 1.0223 0.9948 0.9969 0.9962 0.9970 0.9941 0.9970 1.0364
dispcorr: -0.025498184 hartree
energy: -1797.807110529525
dipole: -5.33796 3.98151 -1.35646 13.14326 -12.27192 0.87134 6.30231 -5.16768 1.13462
magnitude: 1.97144 au
magnitude: 5.01100 debye
