program: Orca
programVersion: 4.2.1
elementType: S O O O O O O O N N N N N N C C C C C C C C C C C C C C H H H H H H H H H H H H H H H H H H
charge: 0
multiplicity: 1
keywords: wb97x-d3
keywords: def2-TZVPP
keywords: def2/J RIJCOSX GRIDX6 NOFINALGRIDX
keywords: grid4 nofinalgrid
keywords: scfconv7
keywords: smallprint printgap noloewdin
keywords: NOSOSCF
formula: C14H18N6O7S
InChI: InChI=1S/C14H18N6O7S/c1-5-27-12(21)8-7-15-20(2)11(8)28(23,24)19-14(22)18-13-16-9(25-3)6-10(17-13)26-4/h6-7,18-19H,5H2,1-4H3
46 atoms
S  1.742553 -0.869863 1.510305
O  1.711918 0.334653 2.29984
O  2.18999 -2.115746 2.076974
O  2.207813 2.666558 -1.541836
O  0.738427 1.743963 -0.125355
O  0.6411 -2.779821 -0.468974
O  -3.086985 1.775964 1.753395
O  -5.691972 -0.521773 -1.326968
N  3.654335 -1.384602 -0.415676
N  0.19683 -1.037522 0.926975
N  4.266619 -0.869146 -1.471192
N  -1.428994 -1.88472 -0.500046
N  -2.237815 -0.038478 0.658489
N  -3.557753 -1.209037 -0.909193
C  2.692038 -0.567244 0.049758
C  2.684577 0.554252 -0.767072
C  3.701619 0.296226 -1.695307
C  4.06346 -2.703828 0.032274
C  1.768548 1.696379 -0.746275
C  -0.128045 -1.958679 -0.032757
C  1.400978 3.839736 -1.676485
C  -2.445934 -0.997105 -0.22687
C  1.611566 4.815039 -0.538245
C  -3.243827 0.801245 0.881171
C  -4.552921 -0.366474 -0.67512
C  -4.461003 0.686006 0.227684
C  -1.836187 1.908551 2.420761
C  -5.802643 -1.593328 -2.249729
H  4.026818 0.91271 -2.517298
H  -0.4719 -0.282774 1.117264
H  4.793067 -3.052376 -0.690353
H  3.211396 -3.375271 0.055677
H  4.517223 -2.658696 1.018173
H  0.348287 3.565271 -1.76468
H  1.715303 4.279836 -2.622218
H  2.662065 5.086903 -0.439309
H  1.048221 5.727764 -0.735502
H  1.266485 4.408573 0.410645
H  -5.27934 1.365652 0.408251
H  -1.947503 2.766293 3.078273
H  -1.604099 1.028496 3.022298
H  -1.020137 2.09022 1.722155
H  -6.804733 -1.52089 -2.66386
H  -5.070299 -1.513749 -3.053491
H  -5.679757 -2.561106 -1.762689
H  -1.651594 -2.576719 -1.199642
totalener: -1797.78160166 hartree
nucrepener: 3079.21204103 hartree
electener: -4876.99364269 hartree
oneelecener: -8586.95886563 hartree
twoeener: 3709.96522294 hartree
kineticenergy: 1791.42529585 hartree
xcener: -147.482928627783 hartree
chargesum: -0.0000000
charge: 0.854214 -0.437967 -0.437712 -0.272344 -0.422025 -0.395401 -0.262835 -0.264313 0.184241 -0.205358 -0.280683 -0.163565 -0.414766 -0.408395 -0.123525 -0.098629 -0.055457 -0.172552 0.490567 0.350534 0.029285 0.358710 -0.252020 0.402099 0.385311 -0.305074 -0.136565 -0.124873 0.140505 0.219259 0.113626 0.138191 0.123018 0.084888 0.099297 0.088170 0.082688 0.097668 0.128217 0.126042 0.107941 0.123258 0.123558 0.107329 0.108098 0.167348
qa: 0.8542 -0.4380 -0.4377 -0.2723 -0.4220 -0.3954 -0.2628 -0.2643 0.1842 -0.2054 -0.2807 -0.1636 -0.4148 -0.4084 -0.1235 -0.0986 -0.0555 -0.1726 0.4906 0.3505 0.0293 0.3587 -0.2520 0.4021 0.3853 -0.3051 -0.1366 -0.1249 0.1405 0.2193 0.1136 0.1382 0.1230 0.0849 0.0993 0.0882 0.0827 0.0977 0.1282 0.1260 0.1079 0.1233 0.1236 0.1073 0.1081 0.1673
va: 5.9131 2.0653 2.0662 2.1442 2.0658 2.1180 2.1618 2.1487 3.3496 3.0974 2.8971 3.1652 2.9714 2.9731 4.0723 3.7015 4.0996 3.8619 4.1155 4.3915 3.8679 4.2479 3.9180 4.0205 4.0557 3.9381 3.8611 3.8773 1.0138 1.0492 1.0090 0.9986 0.9941 1.0132 0.9951 1.0058 1.0093 1.0112 1.0223 0.9949 0.9962 0.9967 0.9942 0.9970 0.9968 1.0364
dispcorr: -0.025512604 hartree
energy: -1797.807114265284
dipole: -5.11011 3.80538 -1.30473 13.23551 -12.34700 0.88852 -6.23947 5.06013 -1.17933
magnitude: 1.97043 au
magnitude: 5.00844 debye
