program: Orca
programVersion: 4.2.1
elementType: S O O O O O O O N N N N N N C C C C C C C C C C C C C C H H H H H H H H H H H H H H H H H H
charge: 0
multiplicity: 1
keywords: wb97x-d3
keywords: def2-TZVPP
keywords: def2/J RIJCOSX GRIDX6 NOFINALGRIDX
keywords: grid4 nofinalgrid
keywords: scfconv7
keywords: smallprint printgap noloewdin
keywords: NOSOSCF
formula: C14H18N6O7S
InChI: InChI=1S/C14H18N6O7S/c1-5-27-12(21)8-7-15-20(2)11(8)28(23,24)19-14(22)18-13-16-9(25-3)6-10(17-13)26-4/h6-7,18-19H,5H2,1-4H3
46 atoms
S  1.707757 -1.770861 0.684975
O  1.548115 -1.492501 2.088864
O  2.186452 -3.05227 0.234929
O  2.076857 2.916289 0.951166
O  0.653924 1.222462 1.298812
O  0.879029 -1.683048 -2.156222
O  -3.261644 0.019651 2.264591
O  -5.413319 0.800352 -1.774404
N  3.790334 -0.778258 -0.832634
N  0.222243 -1.454501 0.011488
N  4.428188 0.332923 -1.170276
N  -1.222655 -0.97574 -1.744911
N  -2.225856 -0.490091 0.294788
N  -3.316214 -0.096202 -1.761005
C  2.737641 -0.52511 -0.034034
C  2.695082 0.849246 0.154267
C  3.78754 1.320267 -0.585903
C  4.268668 -2.032004 -1.387598
C  1.694968 1.645444 0.867059
C  0.032897 -1.400783 -1.343849
C  1.175614 3.846336 1.557479
C  -2.296808 -0.502877 -1.024678
C  0.079573 4.287866 0.610472
C  -3.280915 -0.013511 0.948024
C  -4.361522 0.374524 -1.096981
C  -4.410679 0.447779 0.289867
C  -2.101762 -0.443351 2.949149
C  -5.382252 0.724144 -3.190296
H  4.116685 2.338271 -0.715465
H  -0.502851 -1.051757 0.615961
H  4.611869 -2.701331 -0.604416
H  5.097027 -1.77424 -2.038128
H  3.482577 -2.515754 -1.958559
H  1.804303 4.69088 1.836684
H  0.754837 3.42252 2.470714
H  -0.593032 3.469872 0.358637
H  -0.51342 5.070696 1.084368
H  0.493394 4.697134 -0.310903
H  -5.268748 0.833592 0.818202
H  -1.223552 0.154406 2.708281
H  -2.32939 -0.342038 4.006553
H  -1.89408 -1.491441 2.729509
H  -6.335856 1.122679 -3.526161
H  -4.571155 1.319028 -3.610869
H  -5.275186 -0.303646 -3.53796
H  -1.341358 -0.944623 -2.746321
totalener: -1797.78107175 hartree
nucrepener: 3096.87006473 hartree
electener: -4894.65113647 hartree
oneelecener: -8622.21178771 hartree
twoeener: 3727.56065123 hartree
kineticenergy: 1791.42649191 hartree
xcener: -147.483047269640 hartree
chargesum: -0.0000000
charge: 0.854718 -0.434799 -0.437795 -0.271882 -0.423243 -0.392707 -0.262225 -0.264300 0.183309 -0.207524 -0.279729 -0.163796 -0.414185 -0.407960 -0.121501 -0.105206 -0.054063 -0.172467 0.495794 0.347727 0.025805 0.357233 -0.251339 0.401878 0.384757 -0.305637 -0.137325 -0.124979 0.140062 0.219594 0.123235 0.114104 0.137626 0.100793 0.087116 0.094679 0.085221 0.085901 0.128354 0.125937 0.126254 0.106055 0.123220 0.107335 0.108527 0.167429
qa: 0.8547 -0.4348 -0.4378 -0.2719 -0.4232 -0.3927 -0.2622 -0.2643 0.1833 -0.2075 -0.2797 -0.1638 -0.4142 -0.4080 -0.1215 -0.1052 -0.0541 -0.1725 0.4958 0.3477 0.0258 0.3572 -0.2513 0.4019 0.3848 -0.3056 -0.1373 -0.1250 0.1401 0.2196 0.1232 0.1141 0.1376 0.1008 0.0871 0.0947 0.0852 0.0859 0.1284 0.1259 0.1263 0.1061 0.1232 0.1073 0.1085 0.1674
va: 5.9118 2.0673 2.0665 2.1447 2.0629 2.1200 2.1621 2.1483 3.3518 3.0959 2.8981 3.1645 2.9650 2.9714 4.0817 3.7030 4.0992 3.8612 4.1096 4.3930 3.8753 4.2476 3.9124 4.0170 4.0560 3.9382 3.8561 3.8770 1.0145 1.0495 0.9949 1.0090 0.9978 0.9954 1.0108 1.0120 1.0098 1.0058 1.0223 0.9995 0.9951 0.9958 0.9944 0.9969 0.9969 1.0363
dispcorr: -0.025865619 hartree
energy: -1797.806937365260
dipole: -8.26293 6.93403 -1.32891 15.28198 -13.74285 1.53913 -1.36166 0.89086 -0.47080
magnitude: 2.08724 au
magnitude: 5.30533 debye
