program: Orca
programVersion: 4.2.1
elementType: S O O O O O O O N N N N N N C C C C C C C C C C C C C C H H H H H H H H H H H H H H H H H H
charge: 0
multiplicity: 1
keywords: wb97x-d3
keywords: def2-TZVPP
keywords: def2/J RIJCOSX GRIDX6 NOFINALGRIDX
keywords: grid4 nofinalgrid
keywords: scfconv7
keywords: smallprint printgap noloewdin
keywords: NOSOSCF
formula: C14H18N6O7S
InChI: InChI=1S/C14H18N6O7S/c1-5-27-12(21)8-7-15-20(2)11(8)28(23,24)19-14(22)18-13-16-9(25-3)6-10(17-13)26-4/h6-7,18-19H,5H2,1-4H3
46 atoms
S  1.293939 -1.875836 0.882951
O  0.85724 -1.588186 2.225464
O  1.691967 -3.206228 0.501022
O  2.297645 2.603225 1.762825
O  0.555388 1.240318 1.408897
O  1.118076 -1.697323 -2.071778
O  -4.971028 1.117828 -3.035112
O  -3.694518 0.447226 1.377012
N  3.768634 -1.152296 -0.110491
N  0.052441 -1.358411 -0.088974
N  4.621144 -0.142925 -0.2045
N  -0.954117 -0.80864 -2.109092
N  -2.959133 0.148864 -2.571192
N  -2.313634 -0.191837 -0.326175
C  2.616243 -0.776761 0.474512
C  2.73828 0.570662 0.779897
C  4.023144 0.899079 0.329417
C  4.171544 -2.437427 -0.653528
C  1.735068 1.471799 1.35117
C  0.151249 -1.323668 -1.454355
C  1.448704 3.605738 2.328748
C  -2.125141 -0.263049 -1.632448
C  1.124707 3.32679 3.781091
C  -4.093473 0.685454 -2.146738
C  -3.455415 0.351069 0.085055
C  -4.412758 0.820336 -0.801085
C  -4.657802 0.990852 -4.412713
C  -2.708245 -0.008106 2.297247
H  4.519446 1.855087 0.366285
H  -0.73724 -0.874828 0.352761
H  3.448011 -2.782332 -1.384741
H  4.27382 -3.178969 0.133476
H  5.132497 -2.273514 -1.128518
H  0.53702 3.706674 1.737426
H  2.017262 4.530045 2.233279
H  0.52363 2.426668 3.895858
H  2.031864 3.216795 4.37456
H  0.557112 4.162316 4.192113
H  -5.340169 1.260049 -0.468217
H  -3.756763 1.545505 -4.676219
H  -4.521317 -0.051221 -4.703082
H  -5.508308 1.407105 -4.945959
H  -3.130875 0.163164 3.283433
H  -2.503805 -1.073097 2.179052
H  -1.776075 0.547342 2.200394
H  -0.866972 -0.805212 -3.114201
totalener: -1797.78172882 hartree
nucrepener: 3070.64459775 hartree
electener: -4868.42632657 hartree
oneelecener: -8569.83296267 hartree
twoeener: 3701.40663610 hartree
kineticenergy: 1791.42434808 hartree
xcener: -147.482796224445 hartree
chargesum: 0.0000000
charge: 0.852686 -0.438868 -0.437474 -0.271928 -0.421023 -0.397456 -0.264156 -0.263593 0.182398 -0.205736 -0.280246 -0.163578 -0.409122 -0.417882 -0.120017 -0.097469 -0.055714 -0.173411 0.486649 0.355220 0.028884 0.360721 -0.252729 0.384125 0.401218 -0.303078 -0.124977 -0.134063 0.140372 0.221382 0.138605 0.123017 0.114032 0.085641 0.099323 0.097479 0.088800 0.082791 0.128606 0.107003 0.108550 0.123518 0.125355 0.107384 0.121467 0.167294
qa: 0.8527 -0.4389 -0.4375 -0.2719 -0.4210 -0.3975 -0.2642 -0.2636 0.1824 -0.2057 -0.2802 -0.1636 -0.4091 -0.4179 -0.1200 -0.0975 -0.0557 -0.1734 0.4866 0.3552 0.0289 0.3607 -0.2527 0.3841 0.4012 -0.3031 -0.1250 -0.1341 0.1404 0.2214 0.1386 0.1230 0.1140 0.0856 0.0993 0.0975 0.0888 0.0828 0.1286 0.1070 0.1085 0.1235 0.1254 0.1074 0.1215 0.1673
va: 5.9158 2.0636 2.0669 2.1445 2.0689 2.1164 2.1489 2.1613 3.3509 3.0995 2.8962 3.1661 2.9712 2.9725 4.0705 3.7094 4.0986 3.8609 4.1161 4.3873 3.8682 4.2441 3.9186 4.0573 4.0231 3.9372 3.8775 3.8622 1.0135 1.0448 0.9985 0.9944 1.0091 1.0128 0.9953 1.0111 1.0055 1.0093 1.0222 0.9971 0.9966 0.9943 0.9951 0.9968 0.9989 1.0366
dispcorr: -0.025364589 hartree
energy: -1797.807093413538
dipole: -4.50153 3.52810 -0.97342 13.67174 -12.09180 1.57994 4.40095 -4.88162 -0.48067
magnitude: 1.91698 au
magnitude: 4.87258 debye
