program: Orca
programVersion: 4.2.1
elementType: S O O O O O O O N N N N N N C C C C C C C C C C C C C C H H H H H H H H H H H H H H H H H H
charge: 0
multiplicity: 1
keywords: wb97x-d3
keywords: def2-TZVPP
keywords: def2/J RIJCOSX GRIDX6 NOFINALGRIDX
keywords: grid4 nofinalgrid
keywords: scfconv7
keywords: smallprint printgap noloewdin
keywords: NOSOSCF
formula: C14H18N6O7S
InChI: InChI=1S/C14H18N6O7S/c1-5-27-12(21)8-7-15-20(2)11(8)28(23,24)19-14(22)18-13-16-9(25-3)6-10(17-13)26-4/h6-7,18-19H,5H2,1-4H3
46 atoms
S  1.731576 -0.855508 1.51703
O  1.699312 0.355447 2.296595
O  2.170149 -2.098338 2.097234
O  2.240288 2.65896 -1.551318
O  0.751782 1.749721 -0.146198
O  0.63468 -2.782162 -0.450246
O  -3.09378 1.796321 1.722575
O  -5.70606 -0.54832 -1.316529
N  3.656216 -1.393079 -0.389361
N  0.18998 -1.022292 0.923419
N  4.279668 -0.887942 -1.443318
N  -1.435813 -1.888235 -0.491459
N  -2.244388 -0.028904 0.646185
N  -3.568048 -1.223448 -0.89983
C  2.693396 -0.568364 0.061723
C  2.698091 0.547401 -0.762886
C  3.721626 0.278196 -1.680727
C  4.055722 -2.710907 0.071456
C  1.788209 1.694624 -0.755693
C  -0.134251 -1.955603 -0.024415
C  1.444007 3.838523 -1.693154
C  -2.453898 -0.999972 -0.225274
C  1.653933 4.812081 -0.553256
C  -3.252095 0.810201 0.863546
C  -4.564655 -0.380973 -0.671835
C  -4.472205 0.682603 0.217849
C  -1.838997 1.942257 2.379782
C  -5.81578 -1.630687 -2.226862
H  4.056654 0.887503 -2.504141
H  -0.479649 -0.266047 1.105194
H  3.201506 -3.37971 0.087501
H  4.496432 -2.661361 1.062872
H  4.793694 -3.065658 -0.639435
H  0.389869 3.572873 -1.78964
H  1.76966 4.275723 -2.63635
H  1.29714 4.408969 0.392707
H  2.706072 5.073807 -0.445519
H  1.101106 5.730098 -0.755157
H  -5.291994 1.361628 0.394209
H  -1.949365 2.807962 3.02692
H  -1.599306 1.071005 2.990926
H  -1.028446 2.117961 1.673445
H  -6.820149 -1.56785 -2.636981
H  -5.087617 -1.556209 -3.034901
H  -5.685592 -2.592434 -1.729906
H  -1.659433 -2.588986 -1.181927
totalener: -1797.78163366 hartree
nucrepener: 3077.83163861 hartree
electener: -4875.61327227 hartree
oneelecener: -8584.19981463 hartree
twoeener: 3708.58654236 hartree
kineticenergy: 1791.42794595 hartree
xcener: -147.483489232832 hartree
chargesum: 0.0000000
charge: 0.853673 -0.438028 -0.437816 -0.272293 -0.421676 -0.395366 -0.262951 -0.264295 0.183922 -0.205191 -0.280571 -0.163658 -0.415037 -0.408429 -0.122777 -0.098810 -0.055367 -0.172711 0.490153 0.350830 0.029183 0.358844 -0.252161 0.401766 0.385265 -0.304618 -0.136412 -0.124923 0.140524 0.219328 0.138459 0.122822 0.113681 0.085028 0.099189 0.097630 0.088296 0.082727 0.128276 0.125875 0.107911 0.123358 0.123594 0.107375 0.108083 0.167300
qa: 0.8537 -0.4380 -0.4378 -0.2723 -0.4217 -0.3954 -0.2630 -0.2643 0.1839 -0.2052 -0.2806 -0.1637 -0.4150 -0.4084 -0.1228 -0.0988 -0.0554 -0.1727 0.4902 0.3508 0.0292 0.3588 -0.2522 0.4018 0.3853 -0.3046 -0.1364 -0.1249 0.1405 0.2193 0.1385 0.1228 0.1137 0.0850 0.0992 0.0976 0.0883 0.0827 0.1283 0.1259 0.1079 0.1234 0.1236 0.1074 0.1081 0.1673
va: 5.9136 2.0652 2.0661 2.1441 2.0665 2.1182 2.1620 2.1488 3.3502 3.0972 2.8971 3.1652 2.9719 2.9728 4.0725 3.7020 4.0996 3.8619 4.1155 4.3917 3.8679 4.2476 3.9180 4.0212 4.0556 3.9378 3.8610 3.8773 1.0138 1.0491 0.9984 0.9943 1.0091 1.0132 0.9952 1.0112 1.0058 1.0093 1.0223 0.9949 0.9964 0.9969 0.9942 0.9970 0.9968 1.0364
dispcorr: -0.025487000 hartree
energy: -1797.807120660675
dipole: -4.97697 3.68395 -1.29302 13.18071 -12.30145 0.87927 -6.27266 5.09041 -1.18224
magnitude: 1.96028 au
magnitude: 4.98265 debye
