program: Orca
programVersion: 4.2.1
elementType: S O O O O O O O N N N N N N C C C C C C C C C C C C C C H H H H H H H H H H H H H H H H H H
charge: 0
multiplicity: 1
keywords: wb97x-d3
keywords: def2-TZVPP
keywords: def2/J RIJCOSX GRIDX6 NOFINALGRIDX
keywords: grid4 nofinalgrid
keywords: scfconv7
keywords: smallprint printgap noloewdin
keywords: NOSOSCF
formula: C14H18N6O7S
InChI: InChI=1S/C14H18N6O7S/c1-5-27-12(21)8-7-15-20(2)11(8)28(23,24)19-14(22)18-13-16-9(25-3)6-10(17-13)26-4/h6-7,18-19H,5H2,1-4H3
46 atoms
S  1.721541 -1.74543 0.756992
O  1.579962 -1.399761 2.147791
O  2.196798 -3.046295 0.362803
O  2.05391 2.955747 0.744673
O  0.665108 1.268564 1.231569
O  0.859895 -1.793658 -2.073886
O  -3.228394 0.130841 2.306314
O  -5.418255 0.732141 -1.74186
N  3.789269 -0.825342 -0.825166
N  0.227264 -1.463827 0.087895
N  4.417796 0.268828 -1.229472
N  -1.235642 -1.062267 -1.673061
N  -2.215342 -0.477942 0.352396
N  -3.324054 -0.171353 -1.708767
C  2.739628 -0.534165 -0.035692
C  2.689256 0.848531 0.074499
C  3.773798 1.283683 -0.698545
C  4.269753 -2.105257 -1.314576
C  1.691111 1.676732 0.752144
C  0.023274 -1.47203 -1.266443
C  1.153839 3.907875 1.31796
C  -2.299833 -0.550656 -0.96454
C  0.022957 4.272751 0.379068
C  -3.262305 0.032069 0.993345
C  -4.362226 0.330454 -1.056383
C  -4.398926 0.462831 0.326341
C  -2.054964 -0.280833 2.999567
C  -5.390124 0.621795 -3.155364
H  4.095306 2.294791 -0.887497
H  -0.491398 -1.033047 0.680759
H  5.096155 -1.880099 -1.979424
H  3.483479 -2.619929 -1.857541
H  4.616239 -2.732066 -0.498468
H  1.775334 4.777804 1.526074
H  0.766613 3.534862 2.267511
H  0.402019 4.635413 -0.575899
H  -0.63901 3.428693 0.195057
H  -0.572699 5.06999 0.824353
H  -5.250676 0.874268 0.845485
H  -1.848646 -1.341637 2.851456
H  -1.183033 0.298781 2.699974
H  -2.26255 -0.104463 4.051199
H  -4.583521 1.211616 -3.591075
H  -5.277775 -0.412786 -3.479422
H  -6.346569 1.00731 -3.498335
H  -1.365416 -1.078136 -2.673453
totalener: -1797.78101959 hartree
nucrepener: 3099.45069678 hartree
electener: -4897.23171637 hartree
oneelecener: -8627.36094586 hartree
twoeener: 3730.12922949 hartree
kineticenergy: 1791.43004556 hartree
xcener: -147.483841371283 hartree
chargesum: -0.0000000
charge: 0.855024 -0.434333 -0.437846 -0.272042 -0.424371 -0.391537 -0.262346 -0.264189 0.182798 -0.207609 -0.279696 -0.163947 -0.413301 -0.407691 -0.120571 -0.106037 -0.053782 -0.172114 0.497110 0.346628 0.025592 0.357232 -0.250891 0.400413 0.384559 -0.305118 -0.137992 -0.124925 0.140064 0.219275 0.114314 0.137000 0.123266 0.100869 0.087413 0.085940 0.094086 0.085142 0.128057 0.106451 0.126975 0.125665 0.107313 0.108511 0.123156 0.167482
qa: 0.8550 -0.4343 -0.4378 -0.2720 -0.4244 -0.3915 -0.2623 -0.2642 0.1828 -0.2076 -0.2797 -0.1639 -0.4133 -0.4077 -0.1206 -0.1060 -0.0538 -0.1721 0.4971 0.3466 0.0256 0.3572 -0.2509 0.4004 0.3846 -0.3051 -0.1380 -0.1249 0.1401 0.2193 0.1143 0.1370 0.1233 0.1009 0.0874 0.0859 0.0941 0.0851 0.1281 0.1065 0.1270 0.1257 0.1073 0.1085 0.1232 0.1675
va: 5.9118 2.0674 2.0663 2.1454 2.0623 2.1208 2.1618 2.1482 3.3533 3.0951 2.8982 3.1644 2.9654 2.9712 4.0829 3.7010 4.0999 3.8619 4.1075 4.3941 3.8748 4.2470 3.9124 4.0181 4.0557 3.9381 3.8549 3.8772 1.0144 1.0504 1.0091 0.9978 0.9950 0.9955 1.0106 1.0058 1.0119 1.0098 1.0225 0.9956 0.9996 0.9952 0.9970 0.9968 0.9944 1.0363
dispcorr: -0.025938136 hartree
energy: -1797.806957728653
dipole: -8.36432 7.03559 -1.32873 15.31170 -13.77245 1.53925 -2.05170 1.51661 -0.53508
magnitude: 2.10265 au
magnitude: 5.34452 debye
