program: Orca
programVersion: 4.2.1
elementType: S O O O O O O O N N N N N N C C C C C C C C C C C C C C H H H H H H H H H H H H H H H H H H
charge: 0
multiplicity: 1
keywords: wb97x-d3
keywords: def2-TZVPP
keywords: def2/J RIJCOSX GRIDX6 NOFINALGRIDX
keywords: grid4 nofinalgrid
keywords: scfconv7
keywords: smallprint printgap noloewdin
keywords: NOSOSCF
formula: C14H18N6O7S
InChI: InChI=1S/C14H18N6O7S/c1-5-27-12(21)8-7-15-20(2)11(8)28(23,24)19-14(22)18-13-16-9(25-3)6-10(17-13)26-4/h6-7,18-19H,5H2,1-4H3
46 atoms
S  1.876973 -0.88976 -1.496467
O  2.362073 -2.146225 -2.005768
O  1.893379 0.296019 -2.313437
O  2.020796 2.637077 1.622188
O  0.748944 1.7425 0.010839
O  0.668328 -2.763077 0.450006
O  -2.922434 1.788409 -2.002577
O  -5.627026 -0.349661 1.10531
N  3.674094 -1.347508 0.550134
N  0.298427 -1.051381 -1.0045
N  4.198687 -0.819135 1.646242
N  -1.392035 -1.849141 0.37688
N  -2.134894 -0.016032 -0.845308
N  -3.507023 -1.106055 0.736021
C  2.727379 -0.553321 0.01824
C  2.635183 0.566438 0.832925
C  3.59008 0.330728 1.830974
C  4.139319 -2.65961 0.137195
C  1.698826 1.688009 0.747992
C  -0.074402 -1.946332 -0.03686
C  1.163049 3.777397 1.717526
C  -2.380673 -0.94294 0.064006
C  -0.074889 3.500675 2.544659
C  -3.11447 0.844339 -1.10436
C  -4.475385 -0.243498 0.465544
C  -4.342138 0.7815 -0.463045
C  -1.665921 1.862368 -2.668607
C  -5.780167 -1.392556 2.054343
H  3.841884 0.953815 2.673459
H  -0.357021 -0.298737 -1.242744
H  4.636595 -2.613196 -0.827166
H  3.307528 -3.354502 0.082778
H  4.843651 -2.98008 0.896798
H  0.895351 4.131476 0.72076
H  1.778376 4.540631 2.192119
H  0.186051 3.126246 3.534261
H  -0.635266 4.426624 2.67758
H  -0.733443 2.781834 2.06089
H  -5.138809 1.478001 -0.673821
H  -1.752463 2.696599 -3.359195
H  -0.848521 2.050149 -1.973625
H  -1.455625 0.953638 -3.234231
H  -5.059364 -1.309586 2.868141
H  -6.786715 -1.283735 2.449337
H  -5.674271 -2.37611 1.59583
H  -1.646219 -2.519124 1.087114
totalener: -1797.78119481 hartree
nucrepener: 3097.50294660 hartree
electener: -4895.28414141 hartree
oneelecener: -8623.47214009 hartree
twoeener: 3728.18799868 hartree
kineticenergy: 1791.42693490 hartree
xcener: -147.483031101162 hartree
chargesum: 0.0000000
charge: 0.855104 -0.437316 -0.434897 -0.272393 -0.423479 -0.392554 -0.261990 -0.264261 0.183917 -0.207716 -0.280521 -0.164405 -0.413681 -0.407988 -0.122957 -0.102971 -0.053653 -0.172684 0.495693 0.347452 0.024946 0.357606 -0.251232 0.400879 0.384994 -0.305050 -0.139228 -0.124978 0.139847 0.219463 0.122971 0.138010 0.113913 0.087180 0.101520 0.085832 0.084945 0.095136 0.128122 0.126443 0.126924 0.106515 0.107049 0.123808 0.108165 0.167522
qa: 0.8551 -0.4373 -0.4349 -0.2724 -0.4235 -0.3926 -0.2620 -0.2643 0.1839 -0.2077 -0.2805 -0.1644 -0.4137 -0.4080 -0.1230 -0.1030 -0.0537 -0.1727 0.4957 0.3475 0.0249 0.3576 -0.2512 0.4009 0.3850 -0.3051 -0.1392 -0.1250 0.1398 0.2195 0.1230 0.1380 0.1139 0.0872 0.1015 0.0858 0.0849 0.0951 0.1281 0.1264 0.1269 0.1065 0.1070 0.1238 0.1082 0.1675
va: 5.9125 2.0667 2.0679 2.1445 2.0631 2.1199 2.1622 2.1483 3.3507 3.0951 2.8983 3.1642 2.9646 2.9715 4.0791 3.7038 4.0989 3.8619 4.1096 4.3938 3.8745 4.2477 3.9120 4.0175 4.0557 3.9384 3.8555 3.8773 1.0146 1.0497 0.9945 0.9981 1.0091 1.0108 0.9952 1.0059 1.0099 1.0118 1.0224 0.9950 0.9989 0.9957 0.9971 0.9941 0.9968 1.0362
dispcorr: -0.025881320 hartree
energy: -1797.807076129295
dipole: -9.19226 7.73240 -1.45986 10.50974 -9.65733 0.85241 10.50444 -9.27519 1.22925
magnitude: 2.09018 au
magnitude: 5.31281 debye
