program: Gaussian 09
title: 000069127
version: EM64L-G09RevD.01
frameworkgroup: C1[X(C6H4ClNO3)]
method: RPBEPBE
basis: SDD
operation: Freq
keyword: #p
keyword: freq=noraman
keyword: PBEPBE/SDD
title: #p freq=noraman PBEPBE/SDD
converged: YES YES NO YES
title: Mulliken charges:
elementType: Cl O O O N C C C C C C H H H H
charge: 0.043474 -0.422135 -0.213628 -0.174853 0.015779 0.552058 -0.518461 -0.332176 0.341774 -0.141877 -0.347891 0.290631 0.267906 0.270826 0.368572
chargesum: 0.00000
title: Mulliken charges with hydrogens summed into heavy atoms:
elementType: Cl O O O N C C C C C C
charge: 0.043474 -0.053563 -0.213628 -0.174853 0.015779 0.552058 -0.227829 -0.332176 0.341774 0.126029 -0.077065
polarizability: 1.34524961e+02 -4.56409251e+00 1.14896785e+02 4.74685646e-03 -4.86120175e-03 3.47771622e+01
1716.lowfreq: -29.8769 -6.3046 -5.2762 0.0016 0.0020 0.0026 7.4237 98.8787 165.4115
frequency: -29.8565 98.8785 165.4114 205.8010 246.5949 318.8162 332.8237 382.2505 386.1749 415.1518 431.3024 517.1017 540.0105 639.7452 662.3786 669.7026 716.9483 750.4290 828.7380 889.3797 906.0862 958.4844 1015.7130 1095.5536 1124.3816 1148.1261 1192.6220 1229.4790 1281.4189 1372.0196 1387.9329 1422.2535 1473.2136 1584.0299 1615.4348 3156.7965 3167.3318 3188.1869 3585.0453
redmass: 16.2982 5.7409 7.0661 15.2425 9.5579 6.0313 16.1083 1.1307 7.0657 8.6657 3.3875 6.1245 4.3922 7.2677 8.3206 3.8929 6.6411 11.6874 1.3989 1.5305 6.0787 1.3463 5.7689 2.1070 1.5916 1.2383 13.5592 1.6609 2.1461 5.2409 5.2281 5.2689 3.1865 7.2085 6.8114 1.0915 1.0892 1.0977 1.0663
irintensity: 0.0001 0.6991 1.7724 1.9581 4.8552 0.0197 0.8639 156.8237 6.9426 0.8562 7.0380 8.6931 25.2053 21.1402 5.6986 0.3236 5.1005 31.9691 31.0468 39.9574 3.4263 0.0805 28.8903 31.1250 126.1413 166.2014 252.5152 10.3168 9.1874 17.4961 121.0616 21.1833 167.9090 11.7420 29.1268 9.6451 0.6566 1.5759 59.6404
temp: 298.150 k
press: 1.00000 atm
elementType: 17 8 8 8 7 6 6 6 6 6 6 1 1 1 1
symmnumber: 1
zpe: 245843.1 jmol-1
zpe.correction: 0.093637 hartree
zpe.thermalcorrener: 0.102275 hartree
zpe.thermalcorrenthalpy: 0.103220 hartree
zpe.thermalcorrgfe: 0.059430 hartree
zpe.sumelectzpe: -970.627305 hartree
zpe.sumelectthermal: -970.618666 hartree
zpe.sumelectthermalent: -970.617722 hartree
zpe.sumelectthermalfe: -970.661511 hartree
dipole: -4.3423 -1.7417 0.0006
dipole: 4.6786
quadrupole: -72.7866 -68.0219 -70.2349
quadrupole: -8.9488 -0.0022 0.0047
quadrupole: -2.4388 2.3259 0.1129 -8.9488 -0.0022 0.0047
hfenergy: -970.7209416 hartree
pointgroup: C01 [X(C6H4Cl1N1O3)]
dipole: -1.8351471 -0.1429331 0.000132 debye
dipolederiv: -0.3039721 0.3424654 0.000162 0.28471 -0.3883867 -0.0001417 0.0001799 -0.0001982 0.0040024 -1.0554081 0.6416958 0.0001777 0.753915 -0.5152258 -0.0000071 0.0001993 0.0000021 -0.427987 -0.503213 -0.1085293 -0.0000799 -0.0873847 -0.888784 0.0001574 -0.0000836 0.0003974 -0.2350199 -0.7765964 0.0182373 -0.0004542 0.0415757 -0.4111359 0.0002786 -0.0001114 0.0001606 -0.2004976 1.4530454 0.4312323 0.0006557 0.2573852 1.32757 -0.0005069 0.0004456 -0.0004205 0.1900113 -0.4842688 -0.3857405 -0.0001463 -0.2817732 -0.1589203 0.000045 -0.0001857 -0.000164 0.1309793 -0.2212599 0.4705083 0.0001232 -0.1249228 -0.1631732 -0.0000119 0.0000483 0.0000528 -0.1759307 0.5218403 -0.6268713 -0.000274 -0.1633472 0.483121 0.0002606 -0.0003163 0.0002179 -0.0985874 0.9932352 -0.8367587 -0.0002136 -0.8513187 0.3370094 0.0000446 -0.0001699 0.000005 0.1076868 -0.1936607 0.2410759 0.0000995 0.0516418 0.0459643 0.0000314 0.0000524 0.0000711 -0.0737637 0.0355932 0.0107586 0.0000157 0.2832068 0.0189673 0.0000671 0.0000873 0.0000778 -0.1428885 0.135994 0.020796 0.000006 0.0599694 0.040313 -0.0000615 -0.0000616 -0.000021 0.1897378 0.0931541 0.0053425 0.0000031 -0.0184237 -0.0198004 -0.000063 0.000017 -0.0000806 0.1606212 -0.004323 -0.0385919 -0.0000189 -0.0364982 0.0909831 -0.0000317 -0.0000456 -0.0000393 0.1730553 0.3098398 -0.1856206 -0.0000561 -0.1687354 0.2014982 -0.0000607 -0.0000556 -0.0000612 0.3985808 unknown
polarizability: 130.1644209|-9.3491225|119.2573225|0.0038574|0.0148051|34.7771646 unknown
InChI: InChI=1S/C6H4ClNO3/c7-5-2-1-4(9)3-6(5)8(10)11/h1-3,9H
charge 0 multiplicity 1
15 atoms
Cl 1.715729 -2.38492 -0.000826
O  -3.13939 1.194958 0.000245
O  1.729957 2.226282 -0.000386
O  2.874224 0.261621 0.000959
N  1.778459 0.931835 0.000553
C  0.475095 0.205119 0.000167
C  -0.67824 1.02902 0.000319
C  0.345593 -1.207313 -0.000305
C  -1.959074 0.44795 0.000077
C  -0.953135 -1.77108 -0.000571
C  -2.099633 -0.961969 -0.000359
H  -0.520635 2.112627 0.000614
H  -1.053512 -2.860043 -0.000969
H  -3.101315 -1.399442 -0.000549
H  -2.958024 2.167653 0.00053
