program: Orca
programVersion: 4.2.1
elementType: S O O O O O O O N N N N N N C C C C C C C C C C C C C C H H H H H H H H H H H H H H H H H H
charge: 0
multiplicity: 1
keywords: wb97x-d3
keywords: def2-TZVPP
keywords: def2/J RIJCOSX GRIDX6 NOFINALGRIDX
keywords: grid4 nofinalgrid
keywords: scfconv7
keywords: smallprint printgap noloewdin
keywords: NOSOSCF
formula: C14H18N6O7S
InChI: InChI=1S/C14H18N6O7S/c1-5-27-12(21)8-7-15-20(2)11(8)28(23,24)19-14(22)18-13-16-9(25-3)6-10(17-13)26-4/h6-7,18-19H,5H2,1-4H3
46 atoms
S  1.73019 -1.682096 0.853151
O  1.60889 -1.238033 2.217695
O  2.199749 -3.008277 0.545694
O  2.074268 3.005425 0.516533
O  0.68251 1.361071 1.126586
O  0.827023 -1.92903 -1.954441
O  -3.200763 0.296329 2.339481
O  -5.457396 0.589717 -1.706511
N  3.77332 -0.879819 -0.822535
N  0.226512 -1.44788 0.187909
N  4.396945 0.181912 -1.311986
N  -1.264698 -1.17614 -1.573962
N  -2.215433 -0.449862 0.419408
N  -3.358649 -0.301089 -1.64037
C  2.737423 -0.531645 -0.037987
C  2.690974 0.85552 -0.023201
C  3.763637 1.232964 -0.841912
C  4.244872 -2.19214 -1.227578
C  1.704839 1.73168 0.610435
C  0.001551 -1.552685 -1.159169
C  1.186427 3.998289 1.037809
C  -2.320418 -0.619439 -0.886942
C  0.047094 4.309774 0.089661
C  -3.254779 0.101782 1.037962
C  -4.388458 0.244371 -1.010243
C  -4.403447 0.479112 0.359325
C  -2.016774 -0.065782 3.043266
C  -5.451318 0.372825 -3.108297
H  4.083823 2.227535 -1.106047
H  -0.482229 -0.974824 0.759715
H  5.059745 -2.016487 -1.921337
H  3.448858 -2.74344 -1.71825
H  4.605708 -2.759187 -0.374548
H  1.815404 4.875791 1.182898
H  0.807877 3.689312 2.01364
H  -0.622492 3.45991 -0.031078
H  -0.538237 5.139208 0.488277
H  0.417881 4.606311 -0.891433
H  -5.248758 0.925219 0.860028
H  -2.207183 0.189163 4.082164
H  -1.815474 -1.135626 2.971517
H  -1.148145 0.487083 2.687628
H  -5.34312 -0.68375 -3.355382
H  -6.413487 0.731372 -3.464256
H  -4.652049 0.928011 -3.600609
H  -1.410204 -1.263678 -2.568487
totalener: -1797.78110011 hartree
nucrepener: 3097.98958633 hartree
electener: -4895.77068644 hartree
oneelecener: -8624.44483056 hartree
twoeener: 3728.67414412 hartree
kineticenergy: 1791.42200588 hartree
xcener: -147.482216269401 hartree
chargesum: 0.0000000
charge: 0.855231 -0.434588 -0.438150 -0.272152 -0.424375 -0.391711 -0.262296 -0.264096 0.183181 -0.207081 -0.280144 -0.163597 -0.413104 -0.407654 -0.121315 -0.105676 -0.053213 -0.172675 0.497299 0.346839 0.025258 0.357267 -0.251080 0.400497 0.384613 -0.305207 -0.137695 -0.124561 0.139825 0.218721 0.114580 0.137212 0.123179 0.101213 0.087581 0.094473 0.085015 0.085856 0.127557 0.125491 0.107120 0.126412 0.108528 0.123097 0.106871 0.167450
qa: 0.8552 -0.4346 -0.4381 -0.2722 -0.4244 -0.3917 -0.2623 -0.2641 0.1832 -0.2071 -0.2801 -0.1636 -0.4131 -0.4077 -0.1213 -0.1057 -0.0532 -0.1727 0.4973 0.3468 0.0253 0.3573 -0.2511 0.4005 0.3846 -0.3052 -0.1377 -0.1246 0.1398 0.2187 0.1146 0.1372 0.1232 0.1012 0.0876 0.0945 0.0850 0.0859 0.1276 0.1255 0.1071 0.1264 0.1085 0.1231 0.1069 0.1675
va: 5.9119 2.0672 2.0657 2.1454 2.0619 2.1208 2.1621 2.1483 3.3530 3.0954 2.8981 3.1643 2.9657 2.9710 4.0830 3.7035 4.1001 3.8621 4.1062 4.3940 3.8745 4.2465 3.9123 4.0181 4.0554 3.9381 3.8551 3.8775 1.0145 1.0509 1.0091 0.9978 0.9948 0.9954 1.0106 1.0119 1.0098 1.0058 1.0226 0.9952 0.9955 0.9994 0.9967 0.9943 0.9971 1.0362
dispcorr: -0.025897175 hartree
energy: -1797.806997286708
dipole: -8.35827 7.01952 -1.33874 15.11323 -13.62115 1.49209 -2.95904 2.34198 -0.61706
magnitude: 2.09746 au
magnitude: 5.33131 debye
