program: Orca
programVersion: 4.2.1
elementType: Cl S O O O O O O O N N N N N N C C C C C C C C C C C C C H H H H H H H H H H H H H H H
charge: 0
multiplicity: 1
keywords: wb97x-d3
keywords: def2-TZVPP
keywords: def2/J RIJCOSX GRIDX6 NOFINALGRIDX
keywords: grid4 nofinalgrid
keywords: scfconv7
keywords: smallprint printgap noloewdin
keywords: NOSOSCF
formula: C13H15ClN6O7S
InChI: InChI=1S/C13H15ClN6O7S/c1-20-10(8(9(14)18-20)11(21)27-4)28(23,24)19-13(22)17-12-15-6(25-2)5-7(16-12)26-3/h5,17,19H,1-4H3
43 atoms
Cl 4.142114 2.355279 -1.503145
S  1.365814 -1.65664 1.163926
O  1.314565 -1.043256 2.470265
O  1.769091 -3.037824 1.044297
O  1.966337 2.901914 0.454995
O  0.460558 1.364697 1.055986
O  0.443079 -2.208349 -1.543246
O  -3.46045 0.576997 2.503112
O  -5.695408 0.698142 -1.562312
N  3.426393 -1.191176 -0.611091
N  -0.138564 -1.455428 0.516084
N  4.104943 -0.234014 -1.224524
N  -1.606955 -1.301107 -1.277367
N  -2.516363 -0.364145 0.644778
N  -3.650302 -0.314883 -1.424135
C  2.421007 -0.687289 0.122786
C  2.452197 0.695759 -0.01518
C  3.539208 0.896809 -0.87627
C  3.84583 -2.566651 -0.835111
C  1.518171 1.669099 0.560294
C  -0.379966 -1.693503 -0.813545
C  -2.633687 -0.628258 -0.644032
C  -3.524924 0.28841 1.215151
C  -4.646685 0.338827 -0.842177
C  1.121525 3.949979 0.937467
C  -4.647659 0.677048 0.505735
C  -2.30137 0.193706 3.242047
C  -5.722629 0.38616 -2.953709
H  -0.832548 -0.892763 1.03184
H  4.253568 -3.000711 0.072471
H  3.018465 -3.164388 -1.200255
H  4.621248 -2.533536 -1.59152
H  -1.752499 -1.478217 -2.262795
H  1.65507 4.874347 0.73954
H  0.167554 3.964041 0.411722
H  0.947231 3.855586 2.00858
H  -5.466225 1.209036 0.967477
H  -1.408396 0.697453 2.872955
H  -2.152701 -0.886054 3.229285
H  -2.487397 0.510617 4.264195
H  -5.702414 -0.689232 -3.126376
H  -4.896002 0.853611 -3.487492
H  -6.660425 0.789843 -3.324647
elementType: Cl S O N C H
totalener: -2218.08317157 hartree
nucrepener: 3259.60185453 hartree
electener: -5477.68502610 hartree
oneelecener: -9530.43041621 hartree
twoeener: 4052.74539011 hartree
cpcmener: -0.03991486 hartree
kineticenergy: 2211.23197323 hartree
xcener: -164.127571195630 hartree
chargesum: 0.0000000
charge: -0.022356 0.886859 -0.488915 -0.491048 -0.268472 -0.466391 -0.478862 -0.297850 -0.300289 0.188900 -0.194055 -0.284166 -0.129568 -0.421517 -0.425443 -0.075207 -0.106876 0.079177 -0.148710 0.503175 0.377259 0.368910 0.423980 0.420512 -0.126852 -0.325916 -0.126780 -0.113843 0.225021 0.136697 0.127405 0.118070 0.194084 0.127714 0.120527 0.120181 0.146732 0.109883 0.116464 0.140686 0.114860 0.113815 0.132203
qa: -0.0224 0.8869 -0.4889 -0.4910 -0.2685 -0.4664 -0.4789 -0.2978 -0.3003 0.1889 -0.1941 -0.2842 -0.1296 -0.4215 -0.4254 -0.0752 -0.1069 0.0792 -0.1487 0.5032 0.3773 0.3689 0.4240 0.4205 -0.1269 -0.3259 -0.1268 -0.1138 0.2250 0.1367 0.1274 0.1181 0.1941 0.1277 0.1205 0.1202 0.1467 0.1099 0.1165 0.1407 0.1149 0.1138 0.1322
va: 1.2919 5.8779 2.0072 2.0082 2.1558 2.0190 2.0309 2.1307 2.1211 3.3917 3.0981 2.8686 3.1922 2.9683 2.9712 4.0444 3.7246 4.2869 3.8426 4.0938 4.3901 4.2472 3.9835 4.0155 3.8659 3.9371 3.8395 3.8458 1.0520 0.9908 1.0019 1.0081 1.0157 0.9960 0.9934 0.9920 1.0160 1.0002 0.9916 0.9952 0.9950 0.9957 0.9936
dispcorr: -0.024985496 hartree
energy: -2218.108157067865
dipole: -21.59638 19.55940 -2.03697 0.79992 0.72290 1.52283 2.49947 -3.28617 -0.78670
magnitude: 2.66217 au
magnitude: 6.76671 debye
