program: Orca
programVersion: 4.2.1
elementType: Cl S O O O O O O O N N N N N N C C C C C C C C C C C C C H H H H H H H H H H H H H H H
charge: 0
multiplicity: 1
keywords: wb97x-d3
keywords: def2-TZVPP
keywords: def2/J RIJCOSX GRIDX6 NOFINALGRIDX
keywords: grid4 nofinalgrid
keywords: scfconv7
keywords: smallprint printgap noloewdin
keywords: NOSOSCF
formula: C13H15ClN6O7S
InChI: InChI=1S/C13H15ClN6O7S/c1-20-10(8(9(14)18-20)11(21)27-4)28(23,24)19-13(22)17-12-15-6(25-2)5-7(16-12)26-3/h5,17,19H,1-4H3
43 atoms
Cl 4.244197 2.375492 -1.268418
S  1.318553 -1.742229 1.058149
O  1.262612 -1.234404 2.40867
O  1.679881 -3.121758 0.831988
O  2.05389 2.8402 0.693086
O  0.50995 1.301561 1.182539
O  0.424213 -2.086246 -1.690608
O  -5.736212 0.77259 -1.582687
O  -3.496248 0.504218 2.472672
N  3.428164 -1.20503 -0.636577
N  -0.165964 -1.442805 0.403377
N  4.14005 -0.224918 -1.171022
N  -1.617017 -1.171366 -1.390385
N  -3.673419 -0.20907 -1.490921
N  -2.536083 -0.33408 0.573293
C  2.422313 -0.728108 0.114628
C  2.490434 0.660004 0.075443
C  3.595843 0.89285 -0.753591
C  3.81776 -2.571688 -0.951283
C  1.576137 1.614156 0.711176
C  -0.398397 -1.602218 -0.939597
C  -2.651831 -0.542717 -0.725913
C  -4.680985 0.398816 -0.87951
C  -3.556385 0.272524 1.173084
C  1.230918 3.871857 1.244003
C  -4.687742 0.671387 0.483068
C  -5.750167 0.540554 -2.989856
C  -2.326777 0.117354 3.193064
H  -0.853434 -0.898766 0.946149
H  2.994292 -3.108588 -1.408922
H  4.635572 -2.503647 -1.659065
H  4.160674 -3.092449 -0.063088
H  -1.75877 -1.298557 -2.384057
H  0.279997 3.943729 0.717557
H  1.049426 3.707974 2.305476
H  1.786237 4.795101 1.111776
H  -5.515156 1.166439 0.969446
H  -4.934628 1.06046 -3.491262
H  -6.69729 0.939422 -3.341837
H  -5.699893 -0.522005 -3.224464
H  -1.44449 0.648181 2.837376
H  -2.159429 -0.95871 3.143362
H  -2.513587 0.396071 4.226147
elementType: Cl S O N C H
totalener: -2218.08334656 hartree
nucrepener: 3254.63093770 hartree
electener: -5472.71428426 hartree
oneelecener: -9520.47626348 hartree
twoeener: 4047.76197922 hartree
cpcmener: -0.03999567 hartree
kineticenergy: 2211.23182252 hartree
xcener: -164.127734940491 hartree
chargesum: -0.0000000
charge: -0.022314 0.886080 -0.489075 -0.491061 -0.268750 -0.466346 -0.480531 -0.300518 -0.298213 0.189709 -0.193941 -0.284713 -0.129464 -0.425803 -0.423390 -0.072131 -0.111215 0.079753 -0.148455 0.504690 0.379717 0.370895 0.420299 0.423699 -0.125674 -0.326118 -0.113909 -0.128036 0.226590 0.127432 0.118211 0.135938 0.193885 0.120074 0.119884 0.127647 0.146491 0.114332 0.132222 0.114310 0.112470 0.114866 0.140459
qa: -0.0223 0.8861 -0.4891 -0.4911 -0.2688 -0.4663 -0.4805 -0.3005 -0.2982 0.1897 -0.1939 -0.2847 -0.1295 -0.4258 -0.4234 -0.0721 -0.1112 0.0798 -0.1485 0.5047 0.3797 0.3709 0.4203 0.4237 -0.1257 -0.3261 -0.1139 -0.1280 0.2266 0.1274 0.1182 0.1359 0.1939 0.1201 0.1199 0.1276 0.1465 0.1143 0.1322 0.1143 0.1125 0.1149 0.1405
va: 1.2919 5.8793 2.0059 2.0088 2.1556 2.0212 2.0290 2.1210 2.1303 3.3923 3.0996 2.8683 3.1928 2.9709 2.9689 4.0461 3.7267 4.2854 3.8433 4.0943 4.3880 4.2445 4.0155 3.9845 3.8656 3.9356 3.8457 3.8387 1.0489 1.0013 1.0083 0.9914 1.0159 0.9937 0.9922 0.9961 1.0162 0.9955 0.9937 0.9952 1.0007 0.9924 0.9952
dispcorr: -0.024881596 hartree
energy: -2218.108228159879
dipole: -21.72233 19.74037 -1.98196 0.97333 0.64960 1.62293 2.24684 -2.94954 -0.70270
magnitude: 2.65628 au
magnitude: 6.75174 debye
