program: Gaussian 09
title: 000069126
version: EM64L-G09RevD.01
frameworkgroup: C1[X(C7H8N2O2)]
method: RPBEPBE
basis: SDD
operation: Freq
keyword: #pfreq=noraman
keyword: PBEPBE/SDD
title: #p freq=noraman PBEPBE/SDD
converged: YES YES NO NO
title: Mulliken charges:
elementType: O O N N C C C C C C C H H H H H H H H
charge: -0.448394 -0.326020 -0.684264 -0.714669 0.147754 0.313916 -0.533636 0.554950 -0.381342 -0.407186 0.131221 0.264880 0.216156 0.216140 0.369802 0.296644 0.300198 0.304446 0.379402
chargesum: 0.00000
title: Mulliken charges with hydrogens summed into heavy atoms:
elementType: O O N N C C C C C C C
charge: -0.068992 -0.326020 -0.017818 -0.110025 0.147754 0.313916 -0.268757 0.554950 -0.165186 -0.191045 0.131221
polarizability: 1.45136232e+02 1.55592484e+00 1.23950223e+02 2.67222995e-03 -5.36272781e-03 4.06669289e+01
1716.lowfreq: -7.8576 -7.7213 -0.0008 0.0005 0.0007 0.9893 88.4715 134.1799 160.7107
frequency: 88.4697 134.1782 160.7103 204.3687 256.0499 321.4567 332.4770 352.4712 372.0365 408.1456 408.2626 420.6197 468.4253 507.5649 536.7735 579.0151 621.7339 683.4186 695.9577 707.4433 760.7337 796.0931 811.7654 888.8003 914.7987 935.6048 1000.2162 1031.7167 1053.8817 1137.6601 1169.3896 1268.1506 1305.0927 1317.8669 1348.6577 1409.4899 1441.5584 1506.6926 1561.5415 1580.5461 1626.3739 1637.5350 1667.4699 3112.8385 3138.7812 3159.0932 3426.2506 3535.4667 3576.6160 3656.8513 3717.2904
redmass: 7.5127 5.4527 4.3853 5.2917 1.1495 1.1004 3.6537 4.8663 4.5884 4.5025 1.3378 2.4957 6.4324 3.7237 2.0072 1.4157 4.6502 2.2938 1.4418 6.0802 4.2684 4.9073 1.5871 1.5946 4.2806 1.3582 3.7298 1.6664 1.3748 1.5304 1.1470 1.6004 2.5539 2.0231 4.5511 5.8645 4.8805 2.8306 3.0888 5.4315 1.7227 1.1785 6.5399 1.0866 1.0966 1.0916 1.0543 1.0640 1.0448 1.0960 1.1041
irintensity: 0.0954 0.2175 12.5138 0.9196 231.2250 72.7057 13.4768 16.6640 2.6745 19.1157 149.4058 0.0783 0.1656 9.7966 0.0060 180.2738 35.7160 17.6761 112.3989 1.4095 29.0720 18.4440 46.2974 23.2283 15.6085 0.3070 251.4756 6.8266 12.8711 221.7073 41.7926 26.8200 39.4570 13.0392 152.0483 2.5912 6.8888 101.4316 478.4202 264.1352 68.5898 180.0781 2.8867 17.7397 26.8132 7.4042 92.9035 49.5230 61.3548 46.6581 19.3953
temp: 298.150 k
press: 1.00000 atm
elementType: 8 8 7 7 6 6 6 6 6 6 6 1 1 1 1 1 1 1 1
symmnumber: 1
zpe: 381336.0 jmol-1
zpe.correction: 0.145243 hartree
zpe.thermalcorrener: 0.155470 hartree
zpe.thermalcorrenthalpy: 0.156414 hartree
zpe.thermalcorrgfe: 0.110313 hartree
zpe.sumelectzpe: -530.724066 hartree
zpe.sumelectthermal: -530.713839 hartree
zpe.sumelectthermalent: -530.712895 hartree
zpe.sumelectthermalfe: -530.758997 hartree
dipole: -2.7316 0.2941 0.0090
dipole: 2.7474
quadrupole: -53.6264 -48.7607 -69.4852
quadrupole: 0.6381 -0.0148 -0.0154
quadrupole: 3.6644 8.5301 -12.1944 0.6381 -0.0148 -0.0154
hfenergy: -530.8693095 hartree
pointgroup: C01 [X(C7H8N2O2)]
dipole: -1.0782232 -0.0705191 0.0286913 debye
dipolederiv: -0.3260098 -0.2020104 -0.0062592 -0.4616311 -1.4074565 -0.000182 -0.0100747 -0.008323 -0.4273151 -1.3186889 -0.0217631 0.0294649 0.1939042 -0.5585442 -0.0090183 0.0324336 -0.0024181 -0.3642159 -0.784039 0.7976453 0.014513 0.4848908 -0.8270397 -0.0169319 0.0100393 -0.0261104 -0.6764861 -1.0773072 0.6542046 0.0178316 0.8370879 -0.5260025 -0.0244331 0.0225392 -0.019171 -0.7858416 -0.8043557 -0.7330675 0.0130935 -0.0528804 -0.2796485 -0.0018696 0.0233162 0.0192961 -0.0345766 0.6308832 -0.980532 -0.0304191 -0.3950342 0.5652707 0.0188022 -0.0223196 0.0370061 0.0997917 0.073633 0.6819696 0.0017361 -0.2698205 -0.0434864 0.0106098 -0.0116573 -0.0190883 -0.19397 0.8728955 -1.0488308 -0.038779 -1.1130426 0.1206297 0.0353893 -0.0399743 0.0327802 0.1086269 -0.0830675 0.6196216 0.0055569 -0.0967137 0.0751791 0.0069722 -0.0046986 -0.0148595 -0.1946091 -0.0091564 -0.1800826 -0.0073637 0.5170638 0.2882286 -0.0092181 0.0017814 0.012346 -0.1708331 1.869146 0.5872882 -0.0428589 0.459139 1.6016449 0.0063587 -0.0446416 0.0025743 0.2167822 0.1139458 0.0067814 0.0018374 0.026479 -0.0381938 -0.0039493 0.0020777 -0.0034349 0.1716102 0.0698027 0.0125649 0.0030066 -0.0340732 -0.1390829 -0.0034219 0.002368 -0.0048551 0.1626806 -0.1327103 -0.0715531 0.0076851 -0.0473095 0.0724047 0.0001378 0.0080706 0.0009792 0.1550033 0.2792704 0.0139233 0.0032965 -0.0104789 0.2536015 -0.0014401 0.003185 -0.0025265 0.3757906 0.1742307 -0.0715065 0.0051921 -0.0524304 0.1783175 -0.0013225 0.005574 -0.0010145 0.373622 0.1907746 -0.0338594 0.0059756 -0.0372684 0.1276814 -0.002099 0.005784 -0.0024248 0.3955643 0.1422089 -0.0492863 0.0075991 -0.0590798 0.1584083 -0.0006918 0.0058836 -0.0000063 0.3951328 0.1185438 0.018493 0.0088916 0.1111982 0.3780879 -0.0036925 0.0103133 -0.0007496 0.3932428 unknown
polarizability: 144.8673494|-2.3986109|124.1001485|-3.2508551|1.2840631|40.7858864 unknown
InChI: InChI=1S/C7H8N2O2/c8-4-1-2-6(9)5(3-4)7(10)11/h1-3,10H,8-9H2
charge 0 multiplicity 1
19 atoms
O  1.919046 2.106204 -0.065917
O  2.936213 0.028336 -0.128295
N  1.360254 -2.154364 -0.110671
N  -3.05243 1.417269 0.077371
C  0.495652 0.161644 -0.050301
C  0.297892 -1.266263 -0.064802
C  -0.625459 1.04292 -0.002742
C  -1.946788 0.554871 0.030524
C  -1.049186 -1.743059 -0.030762
C  -2.136859 -0.863864 0.015231
C  1.85545 0.700014 -0.084796
H  -0.429063 2.11943 0.00734
H  -1.228547 -2.825021 -0.041376
H  -3.155694 -1.27125 0.040161
H  2.310526 -1.76943 -0.135345
H  1.191529 -3.156244 -0.120491
H  -3.998221 1.050736 0.10254
H  -2.924916 2.42403 0.083424
H  2.878904 2.36414 -0.092194
