program: Orca
programVersion: 4.2.1
elementType: Cl S O O O O O O O N N N N N N C C C C C C C C C C C C C H H H H H H H H H H H H H H H
charge: 0
multiplicity: 1
keywords: wb97x-d3
keywords: def2-TZVPP
keywords: def2/J RIJCOSX GRIDX6 NOFINALGRIDX
keywords: grid4 nofinalgrid
keywords: scfconv7
keywords: smallprint printgap noloewdin
keywords: NOSOSCF
formula: C13H15ClN6O7S
InChI: InChI=1S/C13H15ClN6O7S/c1-20-10(8(9(14)18-20)11(21)27-4)28(23,24)19-13(22)17-12-15-6(25-2)5-7(16-12)26-3/h5,17,19H,1-4H3
43 atoms
Cl 4.397271 2.33207 0.535721
S  1.022309 -1.575348 -1.504036
O  1.431776 -2.958707 -1.56176
O  0.666293 -0.888161 -2.72349
O  1.889482 2.924025 -1.029812
O  0.203146 1.457088 -1.012963
O  0.746443 -2.324741 1.302385
O  -5.233917 0.452214 2.924815
O  -3.917502 0.793127 -1.511084
N  3.440338 -1.190379 -0.223489
N  -0.280835 -1.418396 -0.507046
N  4.258566 -0.256233 0.234669
N  -1.309415 -1.433076 1.573525
N  -3.269847 -0.503681 2.250712
N  -2.601661 -0.319043 -0.005159
C  2.304157 -0.656349 -0.701173
C  2.395101 0.722034 -0.556356
C  3.651286 0.889849 0.037932
C  3.872933 -2.576332 -0.134121
C  1.374464 1.7210 -0.892815
C  -0.216515 -1.765563 0.818671
C  -2.444034 -0.717131 1.244567
C  -4.362913 0.190962 1.965371
C  -3.704456 0.372847 -0.276874
C  0.982949 3.993744 -1.314225
C  -4.647041 0.669107 0.69208
C  -4.971504 -0.016722 4.245948
C  -2.95142 0.504826 -2.520994
H  -1.070936 -0.822295 -0.801583
H  4.808585 -2.574632 0.412903
H  3.144951 -3.170331 0.406219
H  4.039377 -2.995358 -1.121308
H  -1.237716 -1.700521 2.546456
H  0.257502 4.120962 -0.511802
H  1.594709 4.88665 -1.393309
H  0.461007 3.829162 -2.256005
H  -5.540512 1.235154 0.473362
H  -5.805451 0.329796 4.849688
H  -4.045511 0.396302 4.644306
H  -4.928478 -1.1046 4.285429
H  -3.359557 0.912604 -3.441367
H  -2.805741 -0.568166 -2.646394
H  -1.998895 0.989578 -2.311333
elementType: Cl S O N C H
totalener: -2218.08360243 hartree
nucrepener: 3255.22075234 hartree
electener: -5473.30435478 hartree
oneelecener: -9521.65289417 hartree
twoeener: 4048.34853939 hartree
cpcmener: -0.03959728 hartree
kineticenergy: 2211.24080055 hartree
xcener: -164.129177429747 hartree
chargesum: -0.0000000
charge: -0.023549 0.884072 -0.490930 -0.491486 -0.268581 -0.461941 -0.481828 -0.300435 -0.297913 0.189768 -0.193757 -0.285134 -0.129991 -0.425503 -0.420351 -0.069319 -0.103577 0.079890 -0.150909 0.490774 0.382439 0.368960 0.420836 0.423127 -0.126432 -0.325700 -0.114438 -0.129012 0.226352 0.118318 0.128982 0.136006 0.193877 0.121924 0.130241 0.118619 0.146751 0.132976 0.113750 0.114727 0.140196 0.114968 0.113232
qa: -0.0235 0.8841 -0.4909 -0.4915 -0.2686 -0.4619 -0.4818 -0.3004 -0.2979 0.1898 -0.1938 -0.2851 -0.1300 -0.4255 -0.4204 -0.0693 -0.1036 0.0799 -0.1509 0.4908 0.3824 0.3690 0.4208 0.4231 -0.1264 -0.3257 -0.1144 -0.1290 0.2264 0.1183 0.1290 0.1360 0.1939 0.1219 0.1302 0.1186 0.1468 0.1330 0.1138 0.1147 0.1402 0.1150 0.1132
va: 1.2909 5.8818 2.0084 2.0051 2.1550 2.0290 2.0283 2.1210 2.1308 3.3911 3.0973 2.8689 3.1924 2.9699 2.9736 4.0356 3.7331 4.2861 3.8421 4.1026 4.3859 4.2481 4.0157 3.9849 3.8638 3.9359 3.8456 3.8383 1.0526 1.0081 1.0018 0.9911 1.0158 0.9933 0.9954 0.9925 1.0160 0.9934 0.9957 0.9952 0.9955 0.9923 1.0001
dispcorr: -0.024991218 hartree
energy: -2218.108593651636
dipole: -21.55605 19.77518 -1.78087 0.54242 0.89947 1.44189 2.40737 -1.20489 1.20248
magnitude: 2.58776 au
magnitude: 6.57756 debye
