program: Orca
programVersion: 4.2.1
elementType: Cl S O O O O O O O N N N N N N C C C C C C C C C C C C C H H H H H H H H H H H H H H H
charge: 0
multiplicity: 1
keywords: wb97x-d3
keywords: def2-TZVPP
keywords: def2/J RIJCOSX GRIDX6 NOFINALGRIDX
keywords: grid4 nofinalgrid
keywords: scfconv7
keywords: smallprint printgap noloewdin
keywords: NOSOSCF
formula: C13H15ClN6O7S
InChI: InChI=1S/C13H15ClN6O7S/c1-20-10(8(9(14)18-20)11(21)27-4)28(23,24)19-13(22)17-12-15-6(25-2)5-7(16-12)26-3/h5,17,19H,1-4H3
43 atoms
Cl 4.477617 2.26426 -1.079549
S  1.251349 -1.736457 0.967785
O  1.18779 -1.18374 2.303472
O  1.572758 -3.131163 0.77837
O  0.548238 1.417643 0.831025
O  2.376991 2.639462 1.242452
O  0.399755 -1.861858 -1.834605
O  -5.687846 1.145953 -1.500682
O  -3.581708 0.229146 2.533914
N  3.378374 -1.284806 -0.734111
N  -0.214837 -1.395277 0.297602
N  4.176937 -0.334984 -1.192915
N  -1.623866 -0.919735 -1.479568
N  -3.64966 0.112911 -1.495965
N  -2.583385 -0.342708 0.558087
C  2.403824 -0.774036 0.040025
C  2.592066 0.598101 0.100847
C  3.724454 0.791337 -0.695278
C  3.656619 -2.659425 -1.123867
C  1.843644 1.655387 0.795994
C  -0.425326 -1.428877 -1.055987
C  -2.660098 -0.3560 -0.762197
C  -4.663432 0.650329 -0.830545
C  -3.609402 0.195957 1.212443
C  -0.27494 2.387859 1.486699
C  -4.707723 0.722169 0.557394
C  -5.673822 1.09697 -2.926967
C  -2.47891 -0.358639 3.221384
H  -0.940607 -0.94664 0.87941
H  3.993777 -3.242527 -0.272791
H  2.779216 -3.115156 -1.569283
H  4.44994 -2.617649 -1.86134
H  -1.747219 -0.927172 -2.483971
H  -0.06715 2.422732 2.555448
H  -0.140564 3.378333 1.055208
H  -1.299414 2.070723 1.321401
H  -5.540614 1.159637 1.087509
H  -5.63955 0.071992 -3.293785
H  -4.836289 1.657709 -3.339961
H  -6.604409 1.559362 -3.243167
H  -1.546362 0.171307 3.022067
H  -2.364057 -1.414297 2.97572
H  -2.70793 -0.265116 4.278879
elementType: Cl S O N C H
totalener: -2218.08165736 hartree
nucrepener: 3280.26741199 hartree
electener: -5498.34906935 hartree
oneelecener: -9570.16219256 hartree
twoeener: 4071.81312322 hartree
cpcmener: -0.04412530 hartree
kineticenergy: 2211.23216878 hartree
xcener: -164.127393054414 hartree
chargesum: 0.0000000
charge: -0.024227 0.881422 -0.493500 -0.487705 -0.267236 -0.440936 -0.476831 -0.297805 -0.293658 0.189844 -0.184286 -0.284537 -0.127135 -0.422378 -0.432299 -0.076062 -0.067434 0.076549 -0.149773 0.430014 0.384659 0.379706 0.418569 0.400735 -0.134494 -0.308727 -0.114141 -0.114501 0.201661 0.135296 0.128359 0.118867 0.195620 0.137004 0.135564 0.111992 0.147480 0.114706 0.115391 0.132851 0.095077 0.122945 0.143351
qa: -0.0242 0.8814 -0.4935 -0.4877 -0.2672 -0.4409 -0.4768 -0.2978 -0.2937 0.1898 -0.1843 -0.2845 -0.1271 -0.4224 -0.4323 -0.0761 -0.0674 0.0765 -0.1498 0.4300 0.3847 0.3797 0.4186 0.4007 -0.1345 -0.3087 -0.1141 -0.1145 0.2017 0.1353 0.1284 0.1189 0.1956 0.1370 0.1356 0.1120 0.1475 0.1147 0.1154 0.1329 0.0951 0.1229 0.1434
va: 1.2933 5.8708 1.9993 2.0132 2.1288 2.0619 2.0353 2.1267 2.1263 3.3851 3.0896 2.8746 3.1978 2.9750 2.9393 4.0465 3.7241 4.3020 3.8423 4.1748 4.3792 4.2284 4.0252 3.9805 3.8429 3.9437 3.8439 3.8490 1.0817 0.9912 1.0021 1.0075 1.0146 0.9860 0.9999 0.9987 1.0157 0.9954 0.9952 0.9937 0.9823 0.9894 0.9964
dispcorr: -0.026917278 hartree
energy: -2218.108574639551
dipole: -26.78381 22.99388 -3.78994 -2.60265 2.76035 0.15770 2.29643 -3.01374 -0.71731
magnitude: 3.86044 au
magnitude: 9.81247 debye
