program: Orca
programVersion: 4.2.1
elementType: Cl S O O O O O O O N N N N N N C C C C C C C C C C C C C H H H H H H H H H H H H H H H
charge: 0
multiplicity: 1
keywords: wb97x-d3
keywords: def2-TZVPP
keywords: def2/J RIJCOSX GRIDX6 NOFINALGRIDX
keywords: grid4 nofinalgrid
keywords: scfconv7
keywords: smallprint printgap noloewdin
keywords: NOSOSCF
formula: C13H15ClN6O7S
InChI: InChI=1S/C13H15ClN6O7S/c1-20-10(8(9(14)18-20)11(21)27-4)28(23,24)19-13(22)17-12-15-6(25-2)5-7(16-12)26-3/h5,17,19H,1-4H3
43 atoms
Cl 4.623218 2.088279 0.52794
S  0.958579 -1.461257 -1.613365
O  1.294962 -2.848282 -1.827856
O  0.600572 -0.622401 -2.736132
O  0.352566 1.553064 -0.605123
O  2.061908 2.907876 -1.101039
O  0.765098 -2.243117 1.20542
O  -5.089037 0.718417 2.980592
O  -4.054486 0.681038 -1.54331
N  3.419911 -1.32718 -0.367283
N  -0.313849 -1.337907 -0.570846
N  4.315308 -0.477676 0.108139
N  -1.255135 -1.289943 1.54662
N  -3.165707 -0.2898 2.267873
N  -2.644655 -0.299662 -0.032942
C  2.305016 -0.69106 -0.76951
C  2.496499 0.665255 -0.555601
C  3.781472 0.714996 -0.007733
C  3.75596 -2.742242 -0.371661
C  1.627846 1.825749 -0.796607
C  -0.204908 -1.669253 0.753715
C  -2.404474 -0.591246 1.234346
C  -4.28026 0.375283 1.994574
C  -3.768171 0.364615 -0.292096
C  -0.576347 2.623877 -0.804451
C  -4.650775 0.738416 0.704585
C  -4.73384 0.381106 4.320349
C  -3.172929 0.268928 -2.585557
H  -1.143109 -0.793315 -0.85636
H  3.889541 -3.106222 -1.385686
H  4.69166 -2.840903 0.166361
H  2.990869 -3.318182 0.136585
H  -1.141924 -1.516382 2.526255
H  -0.329908 3.482747 -0.182109
H  -0.610617 2.926825 -1.850045
H  -1.54449 2.240035 -0.501118
H  -5.562225 1.278546 0.495684
H  -5.537027 0.76792 4.940915
H  -3.795644 0.848506 4.616943
H  -4.661152 -0.69683 4.458875
H  -2.196706 0.74936 -2.506193
H  -3.640748 0.592737 -3.510565
H  -3.052428 -0.813929 -2.610106
elementType: Cl S O N C H
totalener: -2218.08164440 hartree
nucrepener: 3284.27968583 hartree
electener: -5502.36133023 hartree
oneelecener: -9578.18119610 hartree
twoeener: 4075.81986587 hartree
cpcmener: -0.04392049 hartree
kineticenergy: 2211.24247436 hartree
xcener: -164.129259561046 hartree
chargesum: -0.0000000
charge: -0.023240 0.881679 -0.486714 -0.493343 -0.267840 -0.441147 -0.476588 -0.297606 -0.292786 0.190658 -0.183542 -0.284285 -0.125786 -0.420673 -0.431026 -0.078501 -0.065616 0.075504 -0.150236 0.431527 0.381843 0.377068 0.418166 0.393038 -0.135001 -0.303914 -0.115269 -0.113439 0.202050 0.135927 0.118394 0.128534 0.195689 0.134888 0.136900 0.112685 0.147248 0.133370 0.115386 0.115040 0.094515 0.142977 0.123466
qa: -0.0232 0.8817 -0.4867 -0.4933 -0.2678 -0.4411 -0.4766 -0.2976 -0.2928 0.1907 -0.1835 -0.2843 -0.1258 -0.4207 -0.4310 -0.0785 -0.0656 0.0755 -0.1502 0.4315 0.3818 0.3771 0.4182 0.3930 -0.1350 -0.3039 -0.1153 -0.1134 0.2020 0.1359 0.1184 0.1285 0.1957 0.1349 0.1369 0.1127 0.1472 0.1334 0.1154 0.1150 0.0945 0.1430 0.1235
va: 1.2946 5.8683 2.0138 1.9999 2.1294 2.0621 2.0353 2.1269 2.1260 3.3846 3.0879 2.8750 3.1970 2.9746 2.9383 4.0451 3.7230 4.3042 3.8416 4.1731 4.3815 4.2284 4.0255 3.9856 3.8448 3.9422 3.8442 3.8485 1.0817 0.9909 1.0078 1.0023 1.0145 1.0000 0.9868 0.9982 1.0158 0.9934 0.9953 0.9950 0.9832 0.9963 0.9891
dispcorr: -0.027005815 hartree
energy: -2218.108650217658
dipole: -26.44086 22.95612 -3.48474 -2.56497 2.46932 -0.09565 3.34518 -1.77330 1.57188
magnitude: 3.82405 au
magnitude: 9.71997 debye
