program: Orca
programVersion: 4.2.1
elementType: Cl S O O O O O O O N N N N N N C C C C C C C C C C C C C H H H H H H H H H H H H H H H
charge: 0
multiplicity: 1
keywords: wb97x-d3
keywords: def2-TZVPP
keywords: def2/J RIJCOSX GRIDX6 NOFINALGRIDX
keywords: grid4 nofinalgrid
keywords: scfconv7
keywords: smallprint printgap noloewdin
keywords: NOSOSCF
formula: C13H15ClN6O7S
InChI: InChI=1S/C13H15ClN6O7S/c1-20-10(8(9(14)18-20)11(21)27-4)28(23,24)19-13(22)17-12-15-6(25-2)5-7(16-12)26-3/h5,17,19H,1-4H3
43 atoms
Cl 3.986374 2.493318 -1.069632
S  1.314748 -1.947983 0.950198
O  1.230337 -1.540745 2.333282
O  1.758471 -3.284827 0.634865
O  1.733158 2.693037 0.863056
O  0.305837 1.021514 1.260458
O  0.462697 -2.090068 -1.829528
O  -5.259553 1.520621 -1.589931
O  -3.446161 0.24575 2.486966
N  3.391431 -1.164927 -0.689206
N  -0.185032 -1.688997 0.30834
N  4.044329 -0.108772 -1.148516
N  -1.553697 -1.134641 -1.485331
N  -3.410099 0.177348 -1.543494
N  -2.500124 -0.476248 0.532986
C  2.353834 -0.803669 0.082226
C  2.332742 0.585779 0.135172
C  3.427269 0.942403 -0.664257
C  3.858221 -2.480779 -1.098192
C  1.348334 1.434922 0.814125
C  -0.370607 -1.670289 -1.052282
C  -2.528531 -0.446854 -0.786956
C  -4.344757 0.862561 -0.898806
C  -3.435693 0.225434 1.165645
C  0.833097 3.628246 1.462597
C  -4.411665 0.934368 0.487262
C  -5.215822 1.480268 -3.014624
C  -2.463762 -0.502485 3.201124
H  -0.88948 -1.197853 0.881981
H  3.058254 -3.03913 -1.570907
H  4.652023 -2.317915 -1.817745
H  4.254543 -3.033347 -0.252149
H  -1.650002 -1.106248 -2.492297
H  0.66198 3.395247 2.512926
H  1.316309 4.597006 1.38303
H  -0.119839 3.655615 0.935294
H  -5.17352 1.502171 1.000447
H  -6.038431 2.105905 -3.349228
H  -5.358854 0.468737 -3.393193
H  -4.280397 1.88237 -3.40187
H  -1.456318 -0.137614 3.001524
H  -2.524953 -1.566958 2.974906
H  -2.688377 -0.352583 4.253213
elementType: Cl S O N C H
totalener: -2218.08174944 hartree
nucrepener: 3285.10106475 hartree
electener: -5503.18281419 hartree
oneelecener: -9581.36965693 hartree
twoeener: 4078.18684274 hartree
cpcmener: -0.03979810 hartree
kineticenergy: 2211.23898363 hartree
xcener: -164.127844720892 hartree
chargesum: -0.0000000
charge: -0.021729 0.892703 -0.490756 -0.490329 -0.269302 -0.463330 -0.475058 -0.300179 -0.296952 0.190627 -0.198683 -0.285062 -0.133787 -0.422124 -0.415000 -0.082046 -0.105291 0.079511 -0.147690 0.504325 0.371382 0.362224 0.421631 0.425783 -0.127103 -0.327568 -0.114033 -0.122138 0.223637 0.127378 0.118214 0.135805 0.194621 0.119791 0.128170 0.119781 0.146963 0.132534 0.115179 0.113538 0.102078 0.121375 0.140911
qa: -0.0217 0.8927 -0.4908 -0.4903 -0.2693 -0.4633 -0.4751 -0.3002 -0.2970 0.1906 -0.1987 -0.2851 -0.1338 -0.4221 -0.4150 -0.0820 -0.1053 0.0795 -0.1477 0.5043 0.3714 0.3622 0.4216 0.4258 -0.1271 -0.3276 -0.1140 -0.1221 0.2236 0.1274 0.1182 0.1358 0.1946 0.1198 0.1282 0.1198 0.1470 0.1325 0.1152 0.1135 0.1021 0.1214 0.1409
va: 1.2928 5.8714 2.0044 2.0092 2.1560 2.0210 2.0326 2.1215 2.1292 3.3919 3.0917 2.8687 3.1916 2.9703 2.9676 4.0486 3.7163 4.2879 3.8418 4.0933 4.3948 4.2535 4.0147 3.9810 3.8673 3.9447 3.8450 3.8410 1.0586 1.0023 1.0081 0.9912 1.0153 0.9923 0.9963 0.9930 1.0159 0.9935 0.9950 0.9959 1.0005 0.9903 0.9949
dispcorr: -0.025487088 hartree
energy: -2218.107236530860
dipole: -20.94170 18.92574 -2.01596 1.31913 0.45185 1.77098 2.03185 -2.66475 -0.63289
magnitude: 2.75700 au
magnitude: 7.00773 debye
