program: Orca
programVersion: 4.2.1
elementType: Cl S O O O O O O O N N N N N N C C C C C C C C C C C C C H H H H H H H H H H H H H H H
charge: 0
multiplicity: 1
keywords: wb97x-d3
keywords: def2-TZVPP
keywords: def2/J RIJCOSX GRIDX6 NOFINALGRIDX
keywords: grid4 nofinalgrid
keywords: scfconv7
keywords: smallprint printgap noloewdin
keywords: NOSOSCF
formula: C13H15ClN6O7S
InChI: InChI=1S/C13H15ClN6O7S/c1-20-10(8(9(14)18-20)11(21)27-4)28(23,24)19-13(22)17-12-15-6(25-2)5-7(16-12)26-3/h5,17,19H,1-4H3
43 atoms
Cl 4.129892 2.31659 0.728892
S  1.035494 -1.676465 -1.596814
O  1.517185 -3.03508 -1.677035
O  0.662722 -0.981959 -2.807401
O  1.546133 2.851886 -0.656604
O  0.021137 1.260781 -1.018447
O  0.780507 -2.464751 1.196554
O  -4.753407 1.009053 2.97453
O  -3.882262 0.694282 -1.572258
N  3.427516 -1.193176 -0.307443
N  -0.289202 -1.609351 -0.6135
N  4.174818 -0.238508 0.224406
N  -1.233341 -1.49139 1.505945
N  -2.997032 -0.259444 2.243492
N  -2.567414 -0.42513 -0.070853
C  2.253423 -0.711057 -0.745645
C  2.23981 0.656188 -0.492764
C  3.482124 0.870173 0.118933
C  3.958452 -2.548334 -0.306089
C  1.14886 1.601059 -0.7559
C  -0.184152 -1.897203 0.725829
C  -2.3148 -0.686603 1.198562
C  -4.026221 0.533765 1.978053
C  -3.593692 0.382344 -0.320889
C  0.556969 3.868269 -0.842285
C  -4.382879 0.906729 0.687878
C  -4.403659 0.667115 4.314306
C  -3.07608 0.166867 -2.624701
H  -1.084025 -1.016748 -0.901592
H  4.908443 -2.506983 0.213776
H  3.290861 -3.219106 0.22338
H  4.123827 -2.902597 -1.318306
H  -1.114917 -1.689873 2.490985
H  -0.234726 3.790112 -0.098064
H  1.077026 4.812862 -0.717514
H  0.12514 3.822626 -1.841239
H  -5.218923 1.559714 0.485572
H  -5.121676 1.184892 4.94392
H  -3.398712 1.003486 4.566475
H  -4.481032 -0.405149 4.490364
H  -3.522022 0.531694 -3.545531
H  -3.085632 -0.922924 -2.635046
H  -2.050398 0.529709 -2.56283
elementType: Cl S O N C H
totalener: -2218.08183938 hartree
nucrepener: 3286.71680181 hartree
electener: -5504.79864119 hartree
oneelecener: -9584.58166858 hartree
twoeener: 4079.78302739 hartree
cpcmener: -0.03960605 hartree
kineticenergy: 2211.23514728 hartree
xcener: -164.126976703390 hartree
chargesum: -0.0000000
charge: -0.022271 0.891677 -0.490091 -0.492316 -0.269916 -0.460487 -0.474351 -0.300459 -0.296948 0.189665 -0.197855 -0.284690 -0.133362 -0.421527 -0.414777 -0.080958 -0.102208 0.078601 -0.146985 0.501003 0.370365 0.361624 0.421625 0.425028 -0.125079 -0.326966 -0.114682 -0.123523 0.223118 0.118027 0.127939 0.135076 0.194485 0.120619 0.128315 0.118551 0.146562 0.132949 0.113992 0.114976 0.140705 0.120549 0.104001
qa: -0.0223 0.8917 -0.4901 -0.4923 -0.2699 -0.4605 -0.4744 -0.3005 -0.2969 0.1897 -0.1979 -0.2847 -0.1334 -0.4215 -0.4148 -0.0810 -0.1022 0.0786 -0.1470 0.5010 0.3704 0.3616 0.4216 0.4250 -0.1251 -0.3270 -0.1147 -0.1235 0.2231 0.1180 0.1279 0.1351 0.1945 0.1206 0.1283 0.1186 0.1466 0.1329 0.1140 0.1150 0.1407 0.1205 0.1040
va: 1.2922 5.8707 2.0091 2.0024 2.1557 2.0269 2.0330 2.1211 2.1294 3.3936 3.0895 2.8685 3.1911 2.9698 2.9674 4.0462 3.7180 4.2893 3.8417 4.0937 4.3967 4.2535 4.0152 3.9816 3.8657 3.9435 3.8451 3.8388 1.0599 1.0085 1.0014 0.9920 1.0153 0.9930 0.9962 0.9929 1.0160 0.9932 0.9958 0.9950 0.9952 0.9900 1.0012
dispcorr: -0.025560728 hartree
energy: -2218.107400103494
dipole: -20.58955 18.83608 -1.75347 1.33678 0.25223 1.58901 2.63482 -1.25772 1.37710
magnitude: 2.73788 au
magnitude: 6.95914 debye
