program: Orca
programVersion: 4.2.1
elementType: Cl S O O O O O O O N N N N N N C C C C C C C C C C C C C H H H H H H H H H H H H H H H
charge: 0
multiplicity: 1
keywords: wb97x-d3
keywords: def2-TZVPP
keywords: def2/J RIJCOSX GRIDX6 NOFINALGRIDX
keywords: grid4 nofinalgrid
keywords: scfconv7
keywords: smallprint printgap noloewdin
keywords: NOSOSCF
formula: C13H15ClN6O7S
InChI: InChI=1S/C13H15ClN6O7S/c1-20-10(8(9(14)18-20)11(21)27-4)28(23,24)19-13(22)17-12-15-6(25-2)5-7(16-12)26-3/h5,17,19H,1-4H3
43 atoms
Cl 3.937626 2.488776 -1.188606
S  1.329105 -1.914226 0.988259
O  1.254704 -1.464104 2.358702
O  1.779288 -3.256013 0.705605
O  1.736841 2.717268 0.807215
O  0.293293 1.061157 1.208143
O  0.44002 -2.167858 -1.772611
O  -5.309196 1.40528 -1.599123
O  -3.420746 0.327397 2.499773
N  3.384484 -1.163309 -0.694045
N  -0.179877 -1.685825 0.356871
N  4.022173 -0.11585 -1.19238
N  -1.57416 -1.204462 -1.438576
N  -3.444431 0.085168 -1.523824
N  -2.497043 -0.47038 0.564546
C  2.351556 -0.788459 0.077769
C  2.319501 0.601493 0.091721
C  3.400802 0.944591 -0.730467
C  3.862672 -2.486475 -1.064526
C  1.339805 1.463317 0.761498
C  -0.383896 -1.720302 -1.001217
C  -2.545746 -0.497908 -0.754657
C  -4.377617 0.786326 -0.894613
C  -3.430649 0.247927 1.180905
C  0.842377 3.664237 1.397062
C  -4.425739 0.9150 0.487991
C  -5.276075 1.318414 -3.022179
C  -2.404519 -0.358273 3.229874
H  -0.875321 -1.17054 0.920006
H  4.251241 -3.016015 -0.200377
H  3.071512 -3.0608 -1.533107
H  4.664823 -2.336961 -1.777738
H  -1.684748 -1.217795 -2.444232
H  1.339392 4.626232 1.323513
H  -0.103471 3.704205 0.858464
H  0.656112 3.433078 2.444905
H  -5.186155 1.496089 0.988267
H  -4.353143 1.729258 -3.429785
H  -6.115407 1.913747 -3.370182
H  -5.398321 0.292167 -3.36653
H  -1.412827 0.02636 2.993107
H  -2.438154 -1.433551 3.055539
H  -2.614618 -0.163871 4.277732
elementType: Cl S O N C H
totalener: -2218.08187697 hartree
nucrepener: 3284.70720564 hartree
electener: -5502.78908262 hartree
oneelecener: -9580.55928750 hartree
twoeener: 4077.77020488 hartree
cpcmener: -0.03955468 hartree
kineticenergy: 2211.24077732 hartree
xcener: -164.128039746238 hartree
chargesum: -0.0000000
charge: -0.022086 0.892050 -0.491635 -0.489675 -0.269714 -0.459200 -0.474751 -0.300575 -0.297338 0.190154 -0.198434 -0.285682 -0.133600 -0.422723 -0.414357 -0.081127 -0.101781 0.078529 -0.146816 0.499390 0.371414 0.362169 0.421860 0.426598 -0.126110 -0.329065 -0.113951 -0.123247 0.223333 0.134967 0.127681 0.118110 0.194397 0.128478 0.120177 0.119182 0.146824 0.113904 0.132542 0.114690 0.102866 0.121799 0.140751
qa: -0.0221 0.8920 -0.4916 -0.4897 -0.2697 -0.4592 -0.4748 -0.3006 -0.2973 0.1902 -0.1984 -0.2857 -0.1336 -0.4227 -0.4144 -0.0811 -0.1018 0.0785 -0.1468 0.4994 0.3714 0.3622 0.4219 0.4266 -0.1261 -0.3291 -0.1140 -0.1232 0.2233 0.1350 0.1277 0.1181 0.1944 0.1285 0.1202 0.1192 0.1468 0.1139 0.1325 0.1147 0.1029 0.1218 0.1408
va: 1.2924 5.8722 2.0033 2.0099 2.1555 2.0274 2.0326 2.1211 2.1290 3.3928 3.0914 2.8674 3.1913 2.9704 2.9674 4.0465 3.7174 4.2874 3.8419 4.0969 4.3952 4.2534 4.0146 3.9804 3.8664 3.9434 3.8452 3.8386 1.0592 0.9917 1.0017 1.0083 1.0155 0.9963 0.9932 0.9925 1.0160 0.9958 0.9935 0.9950 1.0013 0.9900 0.9949
dispcorr: -0.025508382 hartree
energy: -2218.107385355962
dipole: -20.72996 18.74290 -1.98707 1.33999 0.42255 1.76254 2.30993 -2.93976 -0.62983
magnitude: 2.72978 au
magnitude: 6.93854 debye
